{"text_format":"3","workbook":"xlsx","n_sheets":5,"sheets":["Conto Economico","Stato Patrimoniale","Grandezze Tecnico-Fisiche","Grandezze Monetarie","Immobilizzazioni"],"not_rendered":{"defined_names":5},"read":"whole","date_system":"1900"}

{"sheet":"Conto Economico","index":0,"n_rows":1494,"n_cols":10,"rows_kept":1494}
["Indice","Prospetto old","ID prospetto","ID voce","ID voce padre","Modifica","Prospetto","Voce 2024","Voce 2025","Voce 2026"]
[{"$f":"CONCATENATE(TEXT(C2,\"000000\"),\".\",TEXT(E2,\"000000\"),\".\",TEXT(D2,\"000000\"))","v":"001990.000000.000001"},"CE Attività PROD EE",1990,1,null,{"$f":"IF(TRIM(H2)=TRIM(I2),\"Invariata\",IF(H2=\"\",\"Aggiunta\",IF(I2=\"\",\"Eliminata\",\"Modificata\")))","v":"Invariata"},"PROD EE","  A.1) VALORE DELLA PRODUZIONE COMPRENSIVO DELLE VENDITE INTERNE","  A.1) VALORE DELLA PRODUZIONE COMPRENSIVO DELLE VENDITE INTERNE","  A.1) VALORE DELLA PRODUZIONE COMPRENSIVO DELLE VENDITE INTERNE"]
["001990.000001.000002","CE Attività PROD EE",1990,2,1,{"$f":"IF(TRIM(H3)=TRIM(I3),\"Invariata\",IF(H3=\"\",\"Aggiunta\",IF(I3=\"\",\"Eliminata\",\"Modificata\")))","v":"Invariata"},"PROD EE","  A) VALORE DELLA PRODUZIONE","  A) VALORE DELLA PRODUZIONE","  A) VALORE DELLA PRODUZIONE"]
["001990.000002.000003","CE Attività PROD EE",1990,3,2,"Invariata","PROD EE","    1) Ricavi delle vendite e delle prestazioni","    1) Ricavi delle vendite e delle prestazioni","    1) Ricavi delle vendite e delle prestazioni"]
["001990.000003.001149","CE Attività PROD EE",1990,1149,3,"Invariata","PROD EE"," Ricavi dalle vendite e dalle prestazioni"," Ricavi dalle vendite e dalle prestazioni"," Ricavi dalle vendite e dalle prestazioni"]
["001990.000002.000253","CE Attività PROD EE",1990,253,2,"Invariata","PROD EE","    2) Variazioni delle rimanenze di prodotti in corso di lavorazione, semilavorati e finiti","    2) Variazioni delle rimanenze di prodotti in corso di lavorazione, semilavorati e finiti","    2) Variazioni delle rimanenze di prodotti in corso di lavorazione, semilavorati e finiti"]
["001990.000253.000254","CE Attività PROD EE",1990,254,253,"Invariata","PROD EE","       Variazioni delle rimanenze di prodotti in corso di lavorazione, semilavorati e finiti","       Variazioni delle rimanenze di prodotti in corso di lavorazione, semilavorati e finiti","       Variazioni delle rimanenze di prodotti in corso di lavorazione, semilavorati e finiti"]
["001990.000002.000255","CE Attività PROD EE",1990,255,2,"Invariata","PROD EE","    3) Variazioni dei lavori in corso su ordinazioni","    3) Variazioni dei lavori in corso su ordinazioni","    3) Variazioni dei lavori in corso su ordinazioni"]
["001990.000255.000256","CE Attività PROD EE",1990,256,255,"Invariata","PROD EE","       Variazioni dei lavori in corso su ordinazione","       Variazioni dei lavori in corso su ordinazione","       Variazioni dei lavori in corso su ordinazione"]
["001990.000002.000257","CE Attività PROD EE",1990,257,2,"Invariata","PROD EE","    4) Incrementi di immobilizzazioni per lavori interni ","    4) Incrementi di immobilizzazioni per lavori interni ","    4) Incrementi di immobilizzazioni per lavori interni "]
["001990.000257.002001","CE Attività PROD EE",1990,2001,257,"Invariata","PROD EE","  Incrementi di immobilizzazioni per lavori interni ","  Incrementi di immobilizzazioni per lavori interni ","  Incrementi di immobilizzazioni per lavori interni "]
["001990.000002.011466","CE Attività PROD EE",1990,11466,2,"Invariata","PROD EE","    5) Altri ricavi e proventi, con separata indicazione dei contributi in conto esercizio","    5) Altri ricavi e proventi, con separata indicazione dei contributi in conto esercizio","    5) Altri ricavi e proventi, con separata indicazione dei contributi in conto esercizio"]
["001990.011466.011457","CE Attività PROD EE",1990,11457,11466,"Invariata","PROD EE","   Altri ricavi e proventi","   Altri ricavi e proventi","   Altri ricavi e proventi"]
["001990.000002.012514","CE Attività PROD EE",1990,12514,2,"Invariata","PROD EE","    5-bis) ricavi non ricorrenti","    5-bis) ricavi non ricorrenti","    5-bis) ricavi non ricorrenti"]
["001990.000001.000302","CE Attività PROD EE",1990,302,1,"Invariata","PROD EE","  VENDITE INTERNE","  VENDITE INTERNE","  VENDITE INTERNE"]
["001990.000302.000304","CE Attività PROD EE",1990,304,302,"Invariata","PROD EE","    Vendita interna di beni e servizi ad altre attività a prezzo di mercato","    Vendita interna di beni e servizi ad altre attività a prezzo di mercato","    Vendita interna di beni e servizi ad altre attività a prezzo di mercato"]
["001990.000302.010968","CE Attività PROD EE",1990,10968,302,"Invariata","PROD EE","    Vendita interna di beni e servizi ad altre attività a costo pieno","    Vendita interna di beni e servizi ad altre attività a costo pieno","    Vendita interna di beni e servizi ad altre attività a costo pieno"]
["001990.000000.000307","CE Attività PROD EE",1990,307,null,"Invariata","PROD EE","B.1) COSTI DELLA PRODUZIONE COMPRENSIVI DEGLI ACQUISTI INTERNI","B.1) COSTI DELLA PRODUZIONE COMPRENSIVI DEGLI ACQUISTI INTERNI","B.1) COSTI DELLA PRODUZIONE COMPRENSIVI DEGLI ACQUISTI INTERNI"]
["001990.000307.000308","CE Attività PROD EE",1990,308,307,"Invariata","PROD EE","  B) COSTI DELLA PRODUZIONE","  B) COSTI DELLA PRODUZIONE","  B) COSTI DELLA PRODUZIONE"]
["001990.000308.000309","CE Attività PROD EE",1990,309,308,"Invariata","PROD EE","    6) Per materie prime, sussidiarie, di consumo e di merci (a livello di attività vanno riportati i consumi)","    6) Per materie prime, sussidiarie, di consumo e di merci (a livello di attività vanno riportati i consumi)","    6) Per materie prime, sussidiarie, di consumo e di merci (a livello di attività vanno riportati i consumi)"]
["001990.000309.002007","CE Attività PROD EE",1990,2007,309,"Invariata","PROD EE","Per acquisto e trasporto dell'energia","Per acquisto e trasporto dell'energia","Per acquisto e trasporto dell'energia"]
["001990.000309.002008","CE Attività PROD EE",1990,2008,309,"Invariata","PROD EE","Altri costi di materie prime, sussidiarie, di consumo e di merci","Altri costi di materie prime, sussidiarie, di consumo e di merci","Altri costi di materie prime, sussidiarie, di consumo e di merci"]
["001990.000308.000416","CE Attività PROD EE",1990,416,308,"Invariata","PROD EE","    7) Per servizi","    7) Per servizi","    7) Per servizi"]
["001990.000416.002003","CE Attività PROD EE",1990,2003,416,"Invariata","PROD EE","     Per servizi","     Per servizi","     Per servizi"]
["001990.000308.000511","CE Attività PROD EE",1990,511,308,"Invariata","PROD EE","    8) Per godimento beni di terzi","    8) Per godimento beni di terzi","    8) Per godimento beni di terzi"]
["001990.000511.002004","CE Attività PROD EE",1990,2004,511,"Invariata","PROD EE","          Per godimento beni di terzi","          Per godimento beni di terzi","          Per godimento beni di terzi"]
["001990.000308.000532","CE Attività PROD EE",1990,532,308,"Invariata","PROD EE","    9) Per il personale ","    9) Per il personale ","    9) Per il personale "]
["001990.000532.002005","CE Attività PROD EE",1990,2005,532,"Invariata","PROD EE","    Per il personale ","    Per il personale ","    Per il personale "]
["001990.000308.000544","CE Attività PROD EE",1990,544,308,"Invariata","PROD EE","    10) Ammortamenti e svalutazioni","    10) Ammortamenti e svalutazioni","    10) Ammortamenti e svalutazioni"]
["001990.000544.000545","CE Attività PROD EE",1990,545,544,"Invariata","PROD EE","       Ammortamento delle immobilizzazioni immateriali","       Ammortamento delle immobilizzazioni immateriali","       Ammortamento delle immobilizzazioni immateriali"]
["001990.000544.000547","CE Attività PROD EE",1990,547,544,"Invariata","PROD EE","       Ammortamento delle immobilizzazioni materiali (ammortamento tecnicoeconomico)","       Ammortamento delle immobilizzazioni materiali (ammortamento tecnicoeconomico)","       Ammortamento delle immobilizzazioni materiali (ammortamento tecnicoeconomico)"]
["001990.000544.000548","CE Attività PROD EE",1990,548,544,"Invariata","PROD EE","       Ammortamento delle immobilizzazioni materiali (ammortamento finanziario)","       Ammortamento delle immobilizzazioni materiali (ammortamento finanziario)","       Ammortamento delle immobilizzazioni materiali (ammortamento finanziario)"]
["001990.000544.000549","CE Attività PROD EE",1990,549,544,"Invariata","PROD EE","       Altre svalutazioni delle immobilizzazioni","       Altre svalutazioni delle immobilizzazioni","       Altre svalutazioni delle immobilizzazioni"]
["001990.000544.000550","CE Attività PROD EE",1990,550,544,"Invariata","PROD EE","       Svalutazione dei crediti compresi nell'attivo circolante e delle disponibilità","       Svalutazione dei crediti compresi nell'attivo circolante e delle disponibilità","       Svalutazione dei crediti compresi nell'attivo circolante e delle disponibilità"]
["001990.000308.000554","CE Attività PROD EE",1990,554,308,"Invariata","PROD EE","    12) Accantonamenti per rischi","    12) Accantonamenti per rischi","    12) Accantonamenti per rischi"]
[{"$f":"CONCATENATE(TEXT(C36,\"000000\"),\".\",TEXT(E36,\"000000\"),\".\",TEXT(D36,\"000000\"))","v":"001990.000554.001135"},"CE Attività PROD EE",1990,1135,554,"Invariata","PROD EE","          - accantonamenti per rischi ","          - accantonamenti per rischi ","          - accantonamenti per rischi "]
["001990.000308.000558","CE Attività PROD EE",1990,558,308,"Invariata","PROD EE","    13) Altri accantonamenti","    13) Altri accantonamenti","    13) Altri accantonamenti"]
["001990.000558.000559","CE Attività PROD EE",1990,559,558,"Invariata","PROD EE","       Altri accantonamenti","       Altri accantonamenti","       Altri accantonamenti"]
["001990.000308.000560","CE Attività PROD EE",1990,560,308,"Invariata","PROD EE","    14) Oneri diversi di gestione","    14) Oneri diversi di gestione","    14) Oneri diversi di gestione"]
["001990.000560.002006","CE Attività PROD EE",1990,2006,560,"Invariata","PROD EE","   Oneri diversi di gestione","   Oneri diversi di gestione","   Oneri diversi di gestione"]
["001990.000308.012515","CE Attività PROD EE",1990,12515,308,"Invariata","PROD EE","    14-bis ) oneri non ricorrenti","    14-bis ) oneri non ricorrenti","    14-bis ) oneri non ricorrenti"]
["001990.000307.000574","CE Attività PROD EE",1990,574,307,"Invariata","PROD EE","  ACQUISTI INTERNI","  ACQUISTI INTERNI","  ACQUISTI INTERNI"]
["001990.000574.010916","CE Attività PROD EE",1990,10916,574,"Invariata","PROD EE","       Acquisto interno di beni e servizi da altre attività a prezzo di mercato","       Acquisto interno di beni e servizi da altre attività a prezzo di mercato","       Acquisto interno di beni e servizi da altre attività a prezzo di mercato"]
["001990.000000.001142","CE Attività PROD EE",1990,1142,null,"Invariata","PROD EE","DIFFERENZA TRA VALORE E COSTI DELLA PRODUZIONE","DIFFERENZA TRA VALORE E COSTI DELLA PRODUZIONE","DIFFERENZA TRA VALORE E COSTI DELLA PRODUZIONE"]
["001990.000000.000603","CE Attività PROD EE",1990,603,null,"Invariata","PROD EE","   COSTI INDIRETTI","   COSTI INDIRETTI","   COSTI INDIRETTI"]
["001990.000603.000605","CE Attività PROD EE",1990,605,603,"Invariata","PROD EE","       Costi attribuiti dalle funzioni operative condivise","       Costi attribuiti dalle funzioni operative condivise","       Costi attribuiti dalle funzioni operative condivise"]
["001990.000605.000608","CE Attività PROD EE",1990,608,605,"Invariata","PROD EE","       Funzione operativa condivisa di misura tra attività di settori diversi o tra attività diverse del settore idrico","       Funzione operativa condivisa di misura tra attività di settori diversi o tra attività diverse del settore idrico","       Funzione operativa condivisa di misura tra attività di settori diversi o tra attività diverse del settore idrico"]
["001990.000605.000610","CE Attività PROD EE",1990,610,605,"Invariata","PROD EE","          Funzione operativa condivisa di cartografia elettronica","          Funzione operativa condivisa di cartografia elettronica","          Funzione operativa condivisa di cartografia elettronica"]
["001990.000605.010937","CE Attività PROD EE",1990,10937,605,"Invariata","PROD EE","       Funzione operativa condivisa commerciale, di vendita e gestione clientela del settore elettrico","       Funzione operativa condivisa commerciale, di vendita e gestione clientela del settore elettrico","       Funzione operativa condivisa commerciale, di vendita e gestione clientela del settore elettrico"]
["001990.000605.010938","CE Attività PROD EE",1990,10938,605,"Invariata","PROD EE","       Funzione operativa condivisa commerciale, di vendita e gestione clientela del settore gas","       Funzione operativa condivisa commerciale, di vendita e gestione clientela del settore gas","       Funzione operativa condivisa commerciale, di vendita e gestione clientela del settore gas"]
["001990.000605.010939","CE Attività PROD EE",1990,10939,605,"Invariata","PROD EE","       Funzione operativa condivisa commerciale, di vendita e gestione clientela comune al settore elettrico e gas","       Funzione operativa condivisa commerciale, di vendita e gestione clientela comune al settore elettrico e gas","       Funzione operativa condivisa commerciale, di vendita e gestione clientela comune al settore elettrico e gas"]
["001990.000605.010940","CE Attività PROD EE",1990,10940,605,"Invariata","PROD EE","       Funzione operativa condivisa di acquisto di energia elettrica","       Funzione operativa condivisa di acquisto di energia elettrica","       Funzione operativa condivisa di acquisto di energia elettrica"]
["001990.000605.010941","CE Attività PROD EE",1990,10941,605,"Invariata","PROD EE","       Funzione operativa condivisa di acquisto di gas","       Funzione operativa condivisa di acquisto di gas","       Funzione operativa condivisa di acquisto di gas"]
["001990.000605.010942","CE Attività PROD EE",1990,10942,605,"Invariata","PROD EE","       Funzione operativa condivisa di acquisto comune di energia elettrica e di gas","       Funzione operativa condivisa di acquisto comune di energia elettrica e di gas","       Funzione operativa condivisa di acquisto comune di energia elettrica e di gas"]
["001990.000605.011512","CE Attività PROD EE",1990,11512,605,"Invariata","PROD EE","       Funzione operativa condivisa di verifica e controllo","       Funzione operativa condivisa di verifica e controllo","       Funzione operativa condivisa di verifica e controllo"]
["001990.000605.011517","CE Attività PROD EE",1990,11517,605,"Invariata","PROD EE","       Funzione operativa condivisa di telecontrollo e ricerca perdite","       Funzione operativa condivisa di telecontrollo e ricerca perdite","       Funzione operativa condivisa di telecontrollo e ricerca perdite"]
["001990.000605.011521","CE Attività PROD EE",1990,11521,605,"Invariata","PROD EE","       Funzione operativa condivisa di manutenzione e servizi tecnici","       Funzione operativa condivisa di manutenzione e servizi tecnici","       Funzione operativa condivisa di manutenzione e servizi tecnici"]
["001990.000603.000612","CE Attività PROD EE",1990,612,603,"Invariata","PROD EE","       Costi attribuiti dai servizi comuni","       Costi attribuiti dai servizi comuni","       Costi attribuiti dai servizi comuni"]
["001990.000612.002010","CE Attività PROD EE",1990,2010,612,"Invariata","PROD EE","          Costi attribuiti dai servizi comuni","          Costi attribuiti dai servizi comuni","          Costi attribuiti dai servizi comuni"]
["001990.000603.010957","CE Attività PROD EE",1990,10957,603,"Invariata","PROD EE","       Acquisto interno di beni e servizi da altre attività a costo pieno","       Acquisto interno di beni e servizi da altre attività a costo pieno","       Acquisto interno di beni e servizi da altre attività a costo pieno"]
["001990.000000.001143","CE Attività PROD EE",1990,1143,null,"Invariata","PROD EE","COSTI DELLA PRODUZIONE (DIRETTI + INDIRETTI)","COSTI DELLA PRODUZIONE (DIRETTI + INDIRETTI)","COSTI DELLA PRODUZIONE (DIRETTI + INDIRETTI)"]
["001990.000000.002009","CE Attività PROD EE",1990,2009,null,"Invariata","PROD EE","DIFFERENZA TRA VALORE E COSTI DELLA PRODUZIONE DOPO TRANSAZIONI INTERNE","DIFFERENZA TRA VALORE E COSTI DELLA PRODUZIONE DOPO TRANSAZIONI INTERNE","DIFFERENZA TRA VALORE E COSTI DELLA PRODUZIONE DOPO TRANSAZIONI INTERNE"]
["001990.000000.001144","CE Attività PROD EE",1990,1144,null,"Invariata","PROD EE","DIFFERENZA TRA VALORE E COSTI DELLA PRODUZIONE DOPO TRANSAZIONI INTERNE E ATTRIBUZIONE DEI VALORI RELATIVI ALLE FUNZIONI OPERATIVE CONDIVISE E AI SERVIZI COMUNI","DIFFERENZA TRA VALORE E COSTI DELLA PRODUZIONE DOPO TRANSAZIONI INTERNE E ATTRIBUZIONE DEI VALORI RELATIVI ALLE FUNZIONI OPERATIVE CONDIVISE E AI SERVIZI COMUNI","DIFFERENZA TRA VALORE E COSTI DELLA PRODUZIONE DOPO TRANSAZIONI INTERNE E ATTRIBUZIONE DEI VALORI RELATIVI ALLE FUNZIONI OPERATIVE CONDIVISE E AI SERVIZI COMUNI"]
["000282.000000.000001","CE Attività DIST EE",282,1,null,"Invariata","DIST EE","  A.1) VALORE DELLA PRODUZIONE COMPRENSIVO DELLE VENDITE INTERNE","  A.1) VALORE DELLA PRODUZIONE COMPRENSIVO DELLE VENDITE INTERNE","  A.1) VALORE DELLA PRODUZIONE COMPRENSIVO DELLE VENDITE INTERNE"]
["000282.000001.000002","CE Attività DIST EE",282,2,1,"Invariata","DIST EE","  A) VALORE DELLA PRODUZIONE","  A) VALORE DELLA PRODUZIONE","  A) VALORE DELLA PRODUZIONE"]
["000282.000002.000003","CE Attività DIST EE",282,3,2,"Invariata","DIST EE","    1) Ricavi delle vendite e delle prestazioni","    1) Ricavi delle vendite e delle prestazioni","    1) Ricavi delle vendite e delle prestazioni"]
["000282.000003.001149","CE Attività DIST EE",282,1149,3,{"$f":"IF(TRIM(H67)=TRIM(I67),\"Invariata\",IF(H67=\"\",\"Aggiunta\",IF(I67=\"\",\"Eliminata\",\"Modificata\")))","v":"Invariata"},"DIST EE"," Ricavi dalle vendite e dalle prestazioni"," Ricavi dalle vendite e dalle prestazioni"," Ricavi dalle vendite e dalle prestazioni"]
["000282.000002.000253","CE Attività DIST EE",282,253,2,"Invariata","DIST EE","    2) Variazioni delle rimanenze di prodotti in corso di lavorazione, semilavorati e finiti","    2) Variazioni delle rimanenze di prodotti in corso di lavorazione, semilavorati e finiti","    2) Variazioni delle rimanenze di prodotti in corso di lavorazione, semilavorati e finiti"]
["000282.000253.000254","CE Attività DIST EE",282,254,253,"Invariata","DIST EE","       Variazioni delle rimanenze di prodotti in corso di lavorazione, semilavorati e finiti","       Variazioni delle rimanenze di prodotti in corso di lavorazione, semilavorati e finiti","       Variazioni delle rimanenze di prodotti in corso di lavorazione, semilavorati e finiti"]
["000282.000002.000255","CE Attività DIST EE",282,255,2,"Invariata","DIST EE","    3) Variazioni dei lavori in corso su ordinazioni","    3) Variazioni dei lavori in corso su ordinazioni","    3) Variazioni dei lavori in corso su ordinazioni"]
["000282.000255.000256","CE Attività DIST EE",282,256,255,"Invariata","DIST EE","       Variazioni dei lavori in corso su ordinazione","       Variazioni dei lavori in corso su ordinazione","       Variazioni dei lavori in corso su ordinazione"]
["000282.000002.000257","CE Attività DIST EE",282,257,2,"Invariata","DIST EE","    4) Incrementi di immobilizzazioni per lavori interni ","    4) Incrementi di immobilizzazioni per lavori interni ","    4) Incrementi di immobilizzazioni per lavori interni "]
["000282.000257.002001","CE Attività DIST EE",282,2001,257,"Invariata","DIST EE","  Incrementi di immobilizzazioni per lavori interni ","  Incrementi di immobilizzazioni per lavori interni ","  Incrementi di immobilizzazioni per lavori interni "]
["000282.000002.011466","CE Attività DIST EE",282,11466,2,"Invariata","DIST EE","    5) Altri ricavi e proventi, con separata indicazione dei contributi in conto esercizio","    5) Altri ricavi e proventi, con separata indicazione dei contributi in conto esercizio","    5) Altri ricavi e proventi, con separata indicazione dei contributi in conto esercizio"]
["000282.011466.011457","CE Attività DIST EE",282,11457,11466,"Invariata","DIST EE","   Altri ricavi e proventi","   Altri ricavi e proventi","   Altri ricavi e proventi"]
["000282.000002.012514","CE Attività DIST EE",282,12514,2,"Invariata","DIST EE","    5-bis) ricavi non ricorrenti","    5-bis) ricavi non ricorrenti","    5-bis) ricavi non ricorrenti"]
["000282.000001.000302","CE Attività DIST EE",282,302,1,"Invariata","DIST EE","  VENDITE INTERNE","  VENDITE INTERNE","  VENDITE INTERNE"]
["000282.000302.000304","CE Attività DIST EE",282,304,302,"Invariata","DIST EE","    Vendita interna di beni e servizi ad altre attività a prezzo di mercato","    Vendita interna di beni e servizi ad altre attività a prezzo di mercato","    Vendita interna di beni e servizi ad altre attività a prezzo di mercato"]
["000282.000302.010968","CE Attività DIST EE",282,10968,302,"Invariata","DIST EE","    Vendita interna di beni e servizi ad altre attività a costo pieno","    Vendita interna di beni e servizi ad altre attività a costo pieno","    Vendita interna di beni e servizi ad altre attività a costo pieno"]
["000282.000000.000307","CE Attività DIST EE",282,307,null,"Invariata","DIST EE","B.1) COSTI DELLA PRODUZIONE COMPRENSIVI DEGLI ACQUISTI INTERNI","B.1) COSTI DELLA PRODUZIONE COMPRENSIVI DEGLI ACQUISTI INTERNI","B.1) COSTI DELLA PRODUZIONE COMPRENSIVI DEGLI ACQUISTI INTERNI"]
["000282.000307.000308","CE Attività DIST EE",282,308,307,"Invariata","DIST EE","  B) COSTI DELLA PRODUZIONE","  B) COSTI DELLA PRODUZIONE","  B) COSTI DELLA PRODUZIONE"]
["000282.000308.000309","CE Attività DIST EE",282,309,308,"Invariata","DIST EE","    6) Per materie prime, sussidiarie, di consumo e di merci (a livello di attività vanno riportati i consumi)","    6) Per materie prime, sussidiarie, di consumo e di merci (a livello di attività vanno riportati i consumi)","    6) Per materie prime, sussidiarie, di consumo e di merci (a livello di attività vanno riportati i consumi)"]
["000282.000309.002007","CE Attività DIST EE",282,2007,309,"Invariata","DIST EE","Per acquisto e trasporto dell'energia","Per acquisto e trasporto dell'energia","Per acquisto e trasporto dell'energia"]
["000282.000309.002008","CE Attività DIST EE",282,2008,309,"Invariata","DIST EE","Altri costi di materie prime, sussidiarie, di consumo e di merci","Altri costi di materie prime, sussidiarie, di consumo e di merci","Altri costi di materie prime, sussidiarie, di consumo e di merci"]
["000282.000308.000416","CE Attività DIST EE",282,416,308,"Invariata","DIST EE","    7) Per servizi","    7) Per servizi","    7) Per servizi"]
["000282.000416.002003","CE Attività DIST EE",282,2003,416,"Invariata","DIST EE","     Per servizi","     Per servizi","     Per servizi"]
["000282.000308.000511","CE Attività DIST EE",282,511,308,"Invariata","DIST EE","    8) Per godimento beni di terzi","    8) Per godimento beni di terzi","    8) Per godimento beni di terzi"]
["000282.000511.002004","CE Attività DIST EE",282,2004,511,"Invariata","DIST EE","          Per godimento beni di terzi","          Per godimento beni di terzi","          Per godimento beni di terzi"]
["000282.000308.000532","CE Attività DIST EE",282,532,308,"Invariata","DIST EE","    9) Per il personale ","    9) Per il personale ","    9) Per il personale "]
["000282.000532.002005","CE Attività DIST EE",282,2005,532,"Invariata","DIST EE","    Per il personale ","    Per il personale ","    Per il personale "]
["000282.000308.000544","CE Attività DIST EE",282,544,308,"Invariata","DIST EE","    10) Ammortamenti e svalutazioni","    10) Ammortamenti e svalutazioni","    10) Ammortamenti e svalutazioni"]
["000282.000544.000545","CE Attività DIST EE",282,545,544,"Invariata","DIST EE","       Ammortamento delle immobilizzazioni immateriali","       Ammortamento delle immobilizzazioni immateriali","       Ammortamento delle immobilizzazioni immateriali"]
["000282.000544.000547","CE Attività DIST EE",282,547,544,"Invariata","DIST EE","       Ammortamento delle immobilizzazioni materiali (ammortamento tecnicoeconomico)","       Ammortamento delle immobilizzazioni materiali (ammortamento tecnicoeconomico)","       Ammortamento delle immobilizzazioni materiali (ammortamento tecnicoeconomico)"]
["000282.000544.000548","CE Attività DIST EE",282,548,544,"Invariata","DIST EE","       Ammortamento delle immobilizzazioni materiali (ammortamento finanziario)","       Ammortamento delle immobilizzazioni materiali (ammortamento finanziario)","       Ammortamento delle immobilizzazioni materiali (ammortamento finanziario)"]
["000282.000544.000549","CE Attività DIST EE",282,549,544,"Invariata","DIST EE","       Altre svalutazioni delle immobilizzazioni","       Altre svalutazioni delle immobilizzazioni","       Altre svalutazioni delle immobilizzazioni"]
["000282.000544.000550","CE Attività DIST EE",282,550,544,"Invariata","DIST EE","       Svalutazione dei crediti compresi nell'attivo circolante e delle disponibilità","       Svalutazione dei crediti compresi nell'attivo circolante e delle disponibilità","       Svalutazione dei crediti compresi nell'attivo circolante e delle disponibilità"]
["000282.000308.000554","CE Attività DIST EE",282,554,308,"Invariata","DIST EE","    12) Accantonamenti per rischi","    12) Accantonamenti per rischi","    12) Accantonamenti per rischi"]
["000282.000554.001135","CE Attività DIST EE",282,1135,554,"Invariata","DIST EE","          - accantonamenti per rischi ","          - accantonamenti per rischi ","          - accantonamenti per rischi "]
["000282.000308.000558","CE Attività DIST EE",282,558,308,"Invariata","DIST EE","    13) Altri accantonamenti","    13) Altri accantonamenti","    13) Altri accantonamenti"]
[{"$f":"CONCATENATE(TEXT(C100,\"000000\"),\".\",TEXT(E100,\"000000\"),\".\",TEXT(D100,\"000000\"))","v":"000282.000558.000559"},"CE Attività DIST EE",282,559,558,"Invariata","DIST EE","       Altri accantonamenti","       Altri accantonamenti","       Altri accantonamenti"]
["000282.000308.000560","CE Attività DIST EE",282,560,308,"Invariata","DIST EE","    14) Oneri diversi di gestione","    14) Oneri diversi di gestione","    14) Oneri diversi di gestione"]
["000282.000560.002006","CE Attività DIST EE",282,2006,560,"Invariata","DIST EE","   Oneri diversi di gestione","   Oneri diversi di gestione","   Oneri diversi di gestione"]
["000282.000308.012515","CE Attività DIST EE",282,12515,308,"Invariata","DIST EE","    14-bis ) oneri non ricorrenti","    14-bis ) oneri non ricorrenti","    14-bis ) oneri non ricorrenti"]
["000282.000307.000574","CE Attività DIST EE",282,574,307,"Invariata","DIST EE","  ACQUISTI INTERNI","  ACQUISTI INTERNI","  ACQUISTI INTERNI"]
["000282.000574.010916","CE Attività DIST EE",282,10916,574,"Invariata","DIST EE","       Acquisto interno di beni e servizi da altre attività a prezzo di mercato","       Acquisto interno di beni e servizi da altre attività a prezzo di mercato","       Acquisto interno di beni e servizi da altre attività a prezzo di mercato"]
["000282.000000.001142","CE Attività DIST EE",282,1142,null,"Invariata","DIST EE","DIFFERENZA TRA VALORE E COSTI DELLA PRODUZIONE","DIFFERENZA TRA VALORE E COSTI DELLA PRODUZIONE","DIFFERENZA TRA VALORE E COSTI DELLA PRODUZIONE"]
["000282.000000.000603","CE Attività DIST EE",282,603,null,"Invariata","DIST EE","   COSTI INDIRETTI","   COSTI INDIRETTI","   COSTI INDIRETTI"]
["000282.000603.000605","CE Attività DIST EE",282,605,603,"Invariata","DIST EE","       Costi attribuiti dalle funzioni operative condivise","       Costi attribuiti dalle funzioni operative condivise","       Costi attribuiti dalle funzioni operative condivise"]
["000282.000605.000608","CE Attività DIST EE",282,608,605,"Invariata","DIST EE","       Funzione operativa condivisa di misura tra attività di settori diversi o tra attività diverse del settore idrico","       Funzione operativa condivisa di misura tra attività di settori diversi o tra attività diverse del settore idrico","       Funzione operativa condivisa di misura tra attività di settori diversi o tra attività diverse del settore idrico"]
["000282.000605.000610","CE Attività DIST EE",282,610,605,"Invariata","DIST EE","          Funzione operativa condivisa di cartografia elettronica","          Funzione operativa condivisa di cartografia elettronica","          Funzione operativa condivisa di cartografia elettronica"]
["000282.000605.010937","CE Attività DIST EE",282,10937,605,"Invariata","DIST EE","       Funzione operativa condivisa commerciale, di vendita e gestione clientela del settore elettrico","       Funzione operativa condivisa commerciale, di vendita e gestione clientela del settore elettrico","       Funzione operativa condivisa commerciale, di vendita e gestione clientela del settore elettrico"]
["000282.000605.010938","CE Attività DIST EE",282,10938,605,"Invariata","DIST EE","       Funzione operativa condivisa commerciale, di vendita e gestione clientela del settore gas","       Funzione operativa condivisa commerciale, di vendita e gestione clientela del settore gas","       Funzione operativa condivisa commerciale, di vendita e gestione clientela del settore gas"]
["000282.000605.010939","CE Attività DIST EE",282,10939,605,"Invariata","DIST EE","       Funzione operativa condivisa commerciale, di vendita e gestione clientela comune al settore elettrico e gas","       Funzione operativa condivisa commerciale, di vendita e gestione clientela comune al settore elettrico e gas","       Funzione operativa condivisa commerciale, di vendita e gestione clientela comune al settore elettrico e gas"]
["000282.000605.010940","CE Attività DIST EE",282,10940,605,"Invariata","DIST EE","       Funzione operativa condivisa di acquisto di energia elettrica","       Funzione operativa condivisa di acquisto di energia elettrica","       Funzione operativa condivisa di acquisto di energia elettrica"]
["000282.000605.010941","CE Attività DIST EE",282,10941,605,"Invariata","DIST EE","       Funzione operativa condivisa di acquisto di gas","       Funzione operativa condivisa di acquisto di gas","       Funzione operativa condivisa di acquisto di gas"]
["000282.000605.010942","CE Attività DIST EE",282,10942,605,"Invariata","DIST EE","       Funzione operativa condivisa di acquisto comune di energia elettrica e di gas","       Funzione operativa condivisa di acquisto comune di energia elettrica e di gas","       Funzione operativa condivisa di acquisto comune di energia elettrica e di gas"]
["000282.000605.011512","CE Attività DIST EE",282,11512,605,"Invariata","DIST EE","       Funzione operativa condivisa di verifica e controllo","       Funzione operativa condivisa di verifica e controllo","       Funzione operativa condivisa di verifica e controllo"]
["000282.000605.011517","CE Attività DIST EE",282,11517,605,"Invariata","DIST EE","       Funzione operativa condivisa di telecontrollo e ricerca perdite","       Funzione operativa condivisa di telecontrollo e ricerca perdite","       Funzione operativa condivisa di telecontrollo e ricerca perdite"]
["000282.000605.011521","CE Attività DIST EE",282,11521,605,"Invariata","DIST EE","       Funzione operativa condivisa di manutenzione e servizi tecnici","       Funzione operativa condivisa di manutenzione e servizi tecnici","       Funzione operativa condivisa di manutenzione e servizi tecnici"]
["000282.000603.000612","CE Attività DIST EE",282,612,603,"Invariata","DIST EE","       Costi attribuiti dai servizi comuni","       Costi attribuiti dai servizi comuni","       Costi attribuiti dai servizi comuni"]
["000282.000612.002010","CE Attività DIST EE",282,2010,612,"Invariata","DIST EE","          Costi attribuiti dai servizi comuni","          Costi attribuiti dai servizi comuni","          Costi attribuiti dai servizi comuni"]
["000282.000603.010957","CE Attività DIST EE",282,10957,603,"Invariata","DIST EE","       Acquisto interno di beni e servizi da altre attività a costo pieno","       Acquisto interno di beni e servizi da altre attività a costo pieno","       Acquisto interno di beni e servizi da altre attività a costo pieno"]
["000282.000000.001143","CE Attività DIST EE",282,1143,null,"Invariata","DIST EE","COSTI DELLA PRODUZIONE (DIRETTI + INDIRETTI)","COSTI DELLA PRODUZIONE (DIRETTI + INDIRETTI)","COSTI DELLA PRODUZIONE (DIRETTI + INDIRETTI)"]
["000282.000000.002009","CE Attività DIST EE",282,2009,null,"Invariata","DIST EE","DIFFERENZA TRA VALORE E COSTI DELLA PRODUZIONE DOPO TRANSAZIONI INTERNE","DIFFERENZA TRA VALORE E COSTI DELLA PRODUZIONE DOPO TRANSAZIONI INTERNE","DIFFERENZA TRA VALORE E COSTI DELLA PRODUZIONE DOPO TRANSAZIONI INTERNE"]
["000282.000000.001144","CE Attività DIST EE",282,1144,null,"Invariata","DIST EE","DIFFERENZA TRA VALORE E COSTI DELLA PRODUZIONE DOPO TRANSAZIONI INTERNE E ATTRIBUZIONE DEI VALORI RELATIVI ALLE FUNZIONI OPERATIVE CONDIVISE E AI SERVIZI COMUNI","DIFFERENZA TRA VALORE E COSTI DELLA PRODUZIONE DOPO TRANSAZIONI INTERNE E ATTRIBUZIONE DEI VALORI RELATIVI ALLE FUNZIONI OPERATIVE CONDIVISE E AI SERVIZI COMUNI","DIFFERENZA TRA VALORE E COSTI DELLA PRODUZIONE DOPO TRANSAZIONI INTERNE E ATTRIBUZIONE DEI VALORI RELATIVI ALLE FUNZIONI OPERATIVE CONDIVISE E AI SERVIZI COMUNI"]
["000283.000000.000001","CE Attività MIS EE",283,1,null,"Invariata","MIS EE","  A.1) VALORE DELLA PRODUZIONE COMPRENSIVO DELLE VENDITE INTERNE","  A.1) VALORE DELLA PRODUZIONE COMPRENSIVO DELLE VENDITE INTERNE","  A.1) VALORE DELLA PRODUZIONE COMPRENSIVO DELLE VENDITE INTERNE"]
["000283.000001.000002","CE Attività MIS EE",283,2,1,"Invariata","MIS EE","  A) VALORE DELLA PRODUZIONE","  A) VALORE DELLA PRODUZIONE","  A) VALORE DELLA PRODUZIONE"]
["000283.000002.000003","CE Attività MIS EE",283,3,2,"Invariata","MIS EE","    1) Ricavi delle vendite e delle prestazioni","    1) Ricavi delle vendite e delle prestazioni","    1) Ricavi delle vendite e delle prestazioni"]
["000283.000003.001149","CE Attività MIS EE",283,1149,3,"Invariata","MIS EE"," Ricavi dalle vendite e dalle prestazioni"," Ricavi dalle vendite e dalle prestazioni"," Ricavi dalle vendite e dalle prestazioni"]
["000283.000002.000253","CE Attività MIS EE",283,253,2,"Invariata","MIS EE","    2) Variazioni delle rimanenze di prodotti in corso di lavorazione, semilavorati e finiti","    2) Variazioni delle rimanenze di prodotti in corso di lavorazione, semilavorati e finiti","    2) Variazioni delle rimanenze di prodotti in corso di lavorazione, semilavorati e finiti"]
["000283.000253.000254","CE Attività MIS EE",283,254,253,{"$f":"IF(TRIM(H131)=TRIM(I131),\"Invariata\",IF(H131=\"\",\"Aggiunta\",IF(I131=\"\",\"Eliminata\",\"Modificata\")))","v":"Invariata"},"MIS EE","       Variazioni delle rimanenze di prodotti in corso di lavorazione, semilavorati e finiti","       Variazioni delle rimanenze di prodotti in corso di lavorazione, semilavorati e finiti","       Variazioni delle rimanenze di prodotti in corso di lavorazione, semilavorati e finiti"]
["000283.000002.000255","CE Attività MIS EE",283,255,2,"Invariata","MIS EE","    3) Variazioni dei lavori in corso su ordinazioni","    3) Variazioni dei lavori in corso su ordinazioni","    3) Variazioni dei lavori in corso su ordinazioni"]
["000283.000255.000256","CE Attività MIS EE",283,256,255,"Invariata","MIS EE","       Variazioni dei lavori in corso su ordinazione","       Variazioni dei lavori in corso su ordinazione","       Variazioni dei lavori in corso su ordinazione"]
["000283.000002.000257","CE Attività MIS EE",283,257,2,"Invariata","MIS EE","    4) Incrementi di immobilizzazioni per lavori interni ","    4) Incrementi di immobilizzazioni per lavori interni ","    4) Incrementi di immobilizzazioni per lavori interni "]
["000283.000257.002001","CE Attività MIS EE",283,2001,257,"Invariata","MIS EE","  Incrementi di immobilizzazioni per lavori interni ","  Incrementi di immobilizzazioni per lavori interni ","  Incrementi di immobilizzazioni per lavori interni "]
["000283.000002.011466","CE Attività MIS EE",283,11466,2,"Invariata","MIS EE","    5) Altri ricavi e proventi, con separata indicazione dei contributi in conto esercizio","    5) Altri ricavi e proventi, con separata indicazione dei contributi in conto esercizio","    5) Altri ricavi e proventi, con separata indicazione dei contributi in conto esercizio"]
["000283.011466.011457","CE Attività MIS EE",283,11457,11466,"Invariata","MIS EE","   Altri ricavi e proventi","   Altri ricavi e proventi","   Altri ricavi e proventi"]
["000283.000002.012514","CE Attività MIS EE",283,12514,2,"Invariata","MIS EE","    5-bis) ricavi non ricorrenti","    5-bis) ricavi non ricorrenti","    5-bis) ricavi non ricorrenti"]
["000283.000001.000302","CE Attività MIS EE",283,302,1,"Invariata","MIS EE","  VENDITE INTERNE","  VENDITE INTERNE","  VENDITE INTERNE"]
["000283.000302.000304","CE Attività MIS EE",283,304,302,"Invariata","MIS EE","    Vendita interna di beni e servizi ad altre attività a prezzo di mercato","    Vendita interna di beni e servizi ad altre attività a prezzo di mercato","    Vendita interna di beni e servizi ad altre attività a prezzo di mercato"]
["000283.000302.010968","CE Attività MIS EE",283,10968,302,"Invariata","MIS EE","    Vendita interna di beni e servizi ad altre attività a costo pieno","    Vendita interna di beni e servizi ad altre attività a costo pieno","    Vendita interna di beni e servizi ad altre attività a costo pieno"]
["000283.000000.000307","CE Attività MIS EE",283,307,null,"Invariata","MIS EE","B.1) COSTI DELLA PRODUZIONE COMPRENSIVI DEGLI ACQUISTI INTERNI","B.1) COSTI DELLA PRODUZIONE COMPRENSIVI DEGLI ACQUISTI INTERNI","B.1) COSTI DELLA PRODUZIONE COMPRENSIVI DEGLI ACQUISTI INTERNI"]
["000283.000307.000308","CE Attività MIS EE",283,308,307,"Invariata","MIS EE","  B) COSTI DELLA PRODUZIONE","  B) COSTI DELLA PRODUZIONE","  B) COSTI DELLA PRODUZIONE"]
["000283.000308.000309","CE Attività MIS EE",283,309,308,"Invariata","MIS EE","    6) Per materie prime, sussidiarie, di consumo e di merci (a livello di attività vanno riportati i consumi)","    6) Per materie prime, sussidiarie, di consumo e di merci (a livello di attività vanno riportati i consumi)","    6) Per materie prime, sussidiarie, di consumo e di merci (a livello di attività vanno riportati i consumi)"]
["000283.000309.002007","CE Attività MIS EE",283,2007,309,"Invariata","MIS EE","Per acquisto e trasporto dell'energia","Per acquisto e trasporto dell'energia","Per acquisto e trasporto dell'energia"]
["000283.000309.002008","CE Attività MIS EE",283,2008,309,"Invariata","MIS EE","Altri costi di materie prime, sussidiarie, di consumo e di merci","Altri costi di materie prime, sussidiarie, di consumo e di merci","Altri costi di materie prime, sussidiarie, di consumo e di merci"]
["000283.000308.000416","CE Attività MIS EE",283,416,308,"Invariata","MIS EE","    7) Per servizi","    7) Per servizi","    7) Per servizi"]
["000283.000416.002003","CE Attività MIS EE",283,2003,416,"Invariata","MIS EE","     Per servizi","     Per servizi","     Per servizi"]
["000283.000308.000511","CE Attività MIS EE",283,511,308,"Invariata","MIS EE","    8) Per godimento beni di terzi","    8) Per godimento beni di terzi","    8) Per godimento beni di terzi"]
["000283.000511.002004","CE Attività MIS EE",283,2004,511,"Invariata","MIS EE","          Per godimento beni di terzi","          Per godimento beni di terzi","          Per godimento beni di terzi"]
["000283.000308.000532","CE Attività MIS EE",283,532,308,"Invariata","MIS EE","    9) Per il personale ","    9) Per il personale ","    9) Per il personale "]
["000283.000532.002005","CE Attività MIS EE",283,2005,532,"Invariata","MIS EE","    Per il personale ","    Per il personale ","    Per il personale "]
["000283.000308.000544","CE Attività MIS EE",283,544,308,"Invariata","MIS EE","    10) Ammortamenti e svalutazioni","    10) Ammortamenti e svalutazioni","    10) Ammortamenti e svalutazioni"]
["000283.000544.000545","CE Attività MIS EE",283,545,544,"Invariata","MIS EE","       Ammortamento delle immobilizzazioni immateriali","       Ammortamento delle immobilizzazioni immateriali","       Ammortamento delle immobilizzazioni immateriali"]
["000283.000544.000547","CE Attività MIS EE",283,547,544,"Invariata","MIS EE","       Ammortamento delle immobilizzazioni materiali (ammortamento tecnicoeconomico)","       Ammortamento delle immobilizzazioni materiali (ammortamento tecnicoeconomico)","       Ammortamento delle immobilizzazioni materiali (ammortamento tecnicoeconomico)"]
["000283.000544.000548","CE Attività MIS EE",283,548,544,"Invariata","MIS EE","       Ammortamento delle immobilizzazioni materiali (ammortamento finanziario)","       Ammortamento delle immobilizzazioni materiali (ammortamento finanziario)","       Ammortamento delle immobilizzazioni materiali (ammortamento finanziario)"]
["000283.000544.000549","CE Attività MIS EE",283,549,544,"Invariata","MIS EE","       Altre svalutazioni delle immobilizzazioni","       Altre svalutazioni delle immobilizzazioni","       Altre svalutazioni delle immobilizzazioni"]
["000283.000544.000550","CE Attività MIS EE",283,550,544,"Invariata","MIS EE","       Svalutazione dei crediti compresi nell'attivo circolante e delle disponibilità","       Svalutazione dei crediti compresi nell'attivo circolante e delle disponibilità","       Svalutazione dei crediti compresi nell'attivo circolante e delle disponibilità"]
["000283.000308.000554","CE Attività MIS EE",283,554,308,"Invariata","MIS EE","    12) Accantonamenti per rischi","    12) Accantonamenti per rischi","    12) Accantonamenti per rischi"]
["000283.000554.001135","CE Attività MIS EE",283,1135,554,"Invariata","MIS EE","          - accantonamenti per rischi ","          - accantonamenti per rischi ","          - accantonamenti per rischi "]
["000283.000308.000558","CE Attività MIS EE",283,558,308,"Invariata","MIS EE","    13) Altri accantonamenti","    13) Altri accantonamenti","    13) Altri accantonamenti"]
["000283.000558.000559","CE Attività MIS EE",283,559,558,"Invariata","MIS EE","       Altri accantonamenti","       Altri accantonamenti","       Altri accantonamenti"]
["000283.000308.000560","CE Attività MIS EE",283,560,308,"Invariata","MIS EE","    14) Oneri diversi di gestione","    14) Oneri diversi di gestione","    14) Oneri diversi di gestione"]
[{"$f":"CONCATENATE(TEXT(C164,\"000000\"),\".\",TEXT(E164,\"000000\"),\".\",TEXT(D164,\"000000\"))","v":"000283.000560.002006"},"CE Attività MIS EE",283,2006,560,"Invariata","MIS EE","   Oneri diversi di gestione","   Oneri diversi di gestione","   Oneri diversi di gestione"]
["000283.000308.012515","CE Attività MIS EE",283,12515,308,"Invariata","MIS EE","    14-bis ) oneri non ricorrenti","    14-bis ) oneri non ricorrenti","    14-bis ) oneri non ricorrenti"]
["000283.000307.000574","CE Attività MIS EE",283,574,307,"Invariata","MIS EE","  ACQUISTI INTERNI","  ACQUISTI INTERNI","  ACQUISTI INTERNI"]
["000283.000574.010916","CE Attività MIS EE",283,10916,574,"Invariata","MIS EE","       Acquisto interno di beni e servizi da altre attività a prezzo di mercato","       Acquisto interno di beni e servizi da altre attività a prezzo di mercato","       Acquisto interno di beni e servizi da altre attività a prezzo di mercato"]
["000283.000000.001142","CE Attività MIS EE",283,1142,null,"Invariata","MIS EE","DIFFERENZA TRA VALORE E COSTI DELLA PRODUZIONE","DIFFERENZA TRA VALORE E COSTI DELLA PRODUZIONE","DIFFERENZA TRA VALORE E COSTI DELLA PRODUZIONE"]
["000283.000000.000603","CE Attività MIS EE",283,603,null,"Invariata","MIS EE","   COSTI INDIRETTI","   COSTI INDIRETTI","   COSTI INDIRETTI"]
["000283.000603.000605","CE Attività MIS EE",283,605,603,"Invariata","MIS EE","       Costi attribuiti dalle funzioni operative condivise","       Costi attribuiti dalle funzioni operative condivise","       Costi attribuiti dalle funzioni operative condivise"]
["000283.000605.000608","CE Attività MIS EE",283,608,605,"Invariata","MIS EE","       Funzione operativa condivisa di misura tra attività di settori diversi o tra attività diverse del settore idrico","       Funzione operativa condivisa di misura tra attività di settori diversi o tra attività diverse del settore idrico","       Funzione operativa condivisa di misura tra attività di settori diversi o tra attività diverse del settore idrico"]
["000283.000605.000610","CE Attività MIS EE",283,610,605,"Invariata","MIS EE","          Funzione operativa condivisa di cartografia elettronica","          Funzione operativa condivisa di cartografia elettronica","          Funzione operativa condivisa di cartografia elettronica"]
["000283.000605.010937","CE Attività MIS EE",283,10937,605,"Invariata","MIS EE","       Funzione operativa condivisa commerciale, di vendita e gestione clientela del settore elettrico","       Funzione operativa condivisa commerciale, di vendita e gestione clientela del settore elettrico","       Funzione operativa condivisa commerciale, di vendita e gestione clientela del settore elettrico"]
["000283.000605.010938","CE Attività MIS EE",283,10938,605,"Invariata","MIS EE","       Funzione operativa condivisa commerciale, di vendita e gestione clientela del settore gas","       Funzione operativa condivisa commerciale, di vendita e gestione clientela del settore gas","       Funzione operativa condivisa commerciale, di vendita e gestione clientela del settore gas"]
["000283.000605.010939","CE Attività MIS EE",283,10939,605,"Invariata","MIS EE","       Funzione operativa condivisa commerciale, di vendita e gestione clientela comune al settore elettrico e gas","       Funzione operativa condivisa commerciale, di vendita e gestione clientela comune al settore elettrico e gas","       Funzione operativa condivisa commerciale, di vendita e gestione clientela comune al settore elettrico e gas"]
["000283.000605.010940","CE Attività MIS EE",283,10940,605,"Invariata","MIS EE","       Funzione operativa condivisa di acquisto di energia elettrica","       Funzione operativa condivisa di acquisto di energia elettrica","       Funzione operativa condivisa di acquisto di energia elettrica"]
["000283.000605.010941","CE Attività MIS EE",283,10941,605,"Invariata","MIS EE","       Funzione operativa condivisa di acquisto di gas","       Funzione operativa condivisa di acquisto di gas","       Funzione operativa condivisa di acquisto di gas"]
["000283.000605.010942","CE Attività MIS EE",283,10942,605,"Invariata","MIS EE","       Funzione operativa condivisa di acquisto comune di energia elettrica e di gas","       Funzione operativa condivisa di acquisto comune di energia elettrica e di gas","       Funzione operativa condivisa di acquisto comune di energia elettrica e di gas"]
["000283.000605.011512","CE Attività MIS EE",283,11512,605,"Invariata","MIS EE","       Funzione operativa condivisa di verifica e controllo","       Funzione operativa condivisa di verifica e controllo","       Funzione operativa condivisa di verifica e controllo"]
["000283.000605.011517","CE Attività MIS EE",283,11517,605,"Invariata","MIS EE","       Funzione operativa condivisa di telecontrollo e ricerca perdite","       Funzione operativa condivisa di telecontrollo e ricerca perdite","       Funzione operativa condivisa di telecontrollo e ricerca perdite"]
["000283.000605.011521","CE Attività MIS EE",283,11521,605,"Invariata","MIS EE","       Funzione operativa condivisa di manutenzione e servizi tecnici","       Funzione operativa condivisa di manutenzione e servizi tecnici","       Funzione operativa condivisa di manutenzione e servizi tecnici"]
["000283.000603.000612","CE Attività MIS EE",283,612,603,"Invariata","MIS EE","       Costi attribuiti dai servizi comuni","       Costi attribuiti dai servizi comuni","       Costi attribuiti dai servizi comuni"]
["000283.000612.002010","CE Attività MIS EE",283,2010,612,"Invariata","MIS EE","          Costi attribuiti dai servizi comuni","          Costi attribuiti dai servizi comuni","          Costi attribuiti dai servizi comuni"]
["000283.000603.010957","CE Attività MIS EE",283,10957,603,"Invariata","MIS EE","       Acquisto interno di beni e servizi da altre attività a costo pieno","       Acquisto interno di beni e servizi da altre attività a costo pieno","       Acquisto interno di beni e servizi da altre attività a costo pieno"]
["000283.000000.001143","CE Attività MIS EE",283,1143,null,"Invariata","MIS EE","COSTI DELLA PRODUZIONE (DIRETTI + INDIRETTI)","COSTI DELLA PRODUZIONE (DIRETTI + INDIRETTI)","COSTI DELLA PRODUZIONE (DIRETTI + INDIRETTI)"]
["000283.000000.002009","CE Attività MIS EE",283,2009,null,"Invariata","MIS EE","DIFFERENZA TRA VALORE E COSTI DELLA PRODUZIONE DOPO TRANSAZIONI INTERNE","DIFFERENZA TRA VALORE E COSTI DELLA PRODUZIONE DOPO TRANSAZIONI INTERNE","DIFFERENZA TRA VALORE E COSTI DELLA PRODUZIONE DOPO TRANSAZIONI INTERNE"]
["000283.000000.001144","CE Attività MIS EE",283,1144,null,"Invariata","MIS EE","DIFFERENZA TRA VALORE E COSTI DELLA PRODUZIONE DOPO TRANSAZIONI INTERNE E ATTRIBUZIONE DEI VALORI RELATIVI ALLE FUNZIONI OPERATIVE CONDIVISE E AI SERVIZI COMUNI","DIFFERENZA TRA VALORE E COSTI DELLA PRODUZIONE DOPO TRANSAZIONI INTERNE E ATTRIBUZIONE DEI VALORI RELATIVI ALLE FUNZIONI OPERATIVE CONDIVISE E AI SERVIZI COMUNI","DIFFERENZA TRA VALORE E COSTI DELLA PRODUZIONE DOPO TRANSAZIONI INTERNE E ATTRIBUZIONE DEI VALORI RELATIVI ALLE FUNZIONI OPERATIVE CONDIVISE E AI SERVIZI COMUNI"]
["001991.000000.000001","CE Attività VEND I EE",1991,1,null,"Invariata","VEND I EE","  A.1) VALORE DELLA PRODUZIONE COMPRENSIVO DELLE VENDITE INTERNE","  A.1) VALORE DELLA PRODUZIONE COMPRENSIVO DELLE VENDITE INTERNE","  A.1) VALORE DELLA PRODUZIONE COMPRENSIVO DELLE VENDITE INTERNE"]
["001991.000001.000002","CE Attività VEND I EE",1991,2,1,"Invariata","VEND I EE","  A) VALORE DELLA PRODUZIONE","  A) VALORE DELLA PRODUZIONE","  A) VALORE DELLA PRODUZIONE"]
["001991.000002.000003","CE Attività VEND I EE",1991,3,2,"Invariata","VEND I EE","    1) Ricavi delle vendite e delle prestazioni","    1) Ricavi delle vendite e delle prestazioni","    1) Ricavi delle vendite e delle prestazioni"]
["001991.000003.001149","CE Attività VEND I EE",1991,1149,3,"Invariata","VEND I EE"," Ricavi dalle vendite e dalle prestazioni"," Ricavi dalle vendite e dalle prestazioni"," Ricavi dalle vendite e dalle prestazioni"]
["001991.000002.000253","CE Attività VEND I EE",1991,253,2,"Invariata","VEND I EE","    2) Variazioni delle rimanenze di prodotti in corso di lavorazione, semilavorati e finiti","    2) Variazioni delle rimanenze di prodotti in corso di lavorazione, semilavorati e finiti","    2) Variazioni delle rimanenze di prodotti in corso di lavorazione, semilavorati e finiti"]
["001991.000253.000254","CE Attività VEND I EE",1991,254,253,"Invariata","VEND I EE","       Variazioni delle rimanenze di prodotti in corso di lavorazione, semilavorati e finiti","       Variazioni delle rimanenze di prodotti in corso di lavorazione, semilavorati e finiti","       Variazioni delle rimanenze di prodotti in corso di lavorazione, semilavorati e finiti"]
["001991.000002.000255","CE Attività VEND I EE",1991,255,2,"Invariata","VEND I EE","    3) Variazioni dei lavori in corso su ordinazioni","    3) Variazioni dei lavori in corso su ordinazioni","    3) Variazioni dei lavori in corso su ordinazioni"]
["001991.000255.000256","CE Attività VEND I EE",1991,256,255,{"$f":"IF(TRIM(H195)=TRIM(I195),\"Invariata\",IF(H195=\"\",\"Aggiunta\",IF(I195=\"\",\"Eliminata\",\"Modificata\")))","v":"Invariata"},"VEND I EE","       Variazioni dei lavori in corso su ordinazione","       Variazioni dei lavori in corso su ordinazione","       Variazioni dei lavori in corso su ordinazione"]
["001991.000002.000257","CE Attività VEND I EE",1991,257,2,"Invariata","VEND I EE","    4) Incrementi di immobilizzazioni per lavori interni ","    4) Incrementi di immobilizzazioni per lavori interni ","    4) Incrementi di immobilizzazioni per lavori interni "]
["001991.000257.002001","CE Attività VEND I EE",1991,2001,257,"Invariata","VEND I EE","  Incrementi di immobilizzazioni per lavori interni ","  Incrementi di immobilizzazioni per lavori interni ","  Incrementi di immobilizzazioni per lavori interni "]
["001991.000002.011466","CE Attività VEND I EE",1991,11466,2,"Invariata","VEND I EE","    5) Altri ricavi e proventi, con separata indicazione dei contributi in conto esercizio","    5) Altri ricavi e proventi, con separata indicazione dei contributi in conto esercizio","    5) Altri ricavi e proventi, con separata indicazione dei contributi in conto esercizio"]
["001991.011466.011457","CE Attività VEND I EE",1991,11457,11466,"Invariata","VEND I EE","   Altri ricavi e proventi","   Altri ricavi e proventi","   Altri ricavi e proventi"]
["001991.000002.012514","CE Attività VEND I EE",1991,12514,2,"Invariata","VEND I EE","    5-bis) ricavi non ricorrenti","    5-bis) ricavi non ricorrenti","    5-bis) ricavi non ricorrenti"]
["001991.000001.000302","CE Attività VEND I EE",1991,302,1,"Invariata","VEND I EE","  VENDITE INTERNE","  VENDITE INTERNE","  VENDITE INTERNE"]
["001991.000302.000304","CE Attività VEND I EE",1991,304,302,"Invariata","VEND I EE","    Vendita interna di beni e servizi ad altre attività a prezzo di mercato","    Vendita interna di beni e servizi ad altre attività a prezzo di mercato","    Vendita interna di beni e servizi ad altre attività a prezzo di mercato"]
["001991.000302.010968","CE Attività VEND I EE",1991,10968,302,"Invariata","VEND I EE","    Vendita interna di beni e servizi ad altre attività a costo pieno","    Vendita interna di beni e servizi ad altre attività a costo pieno","    Vendita interna di beni e servizi ad altre attività a costo pieno"]
["001991.000000.000307","CE Attività VEND I EE",1991,307,null,"Invariata","VEND I EE","B.1) COSTI DELLA PRODUZIONE COMPRENSIVI DEGLI ACQUISTI INTERNI","B.1) COSTI DELLA PRODUZIONE COMPRENSIVI DEGLI ACQUISTI INTERNI","B.1) COSTI DELLA PRODUZIONE COMPRENSIVI DEGLI ACQUISTI INTERNI"]
["001991.000307.000308","CE Attività VEND I EE",1991,308,307,"Invariata","VEND I EE","  B) COSTI DELLA PRODUZIONE","  B) COSTI DELLA PRODUZIONE","  B) COSTI DELLA PRODUZIONE"]
["001991.000308.000309","CE Attività VEND I EE",1991,309,308,"Invariata","VEND I EE","    6) Per materie prime, sussidiarie, di consumo e di merci (a livello di attività vanno riportati i consumi)","    6) Per materie prime, sussidiarie, di consumo e di merci (a livello di attività vanno riportati i consumi)","    6) Per materie prime, sussidiarie, di consumo e di merci (a livello di attività vanno riportati i consumi)"]
["001991.000309.002007","CE Attività VEND I EE",1991,2007,309,"Invariata","VEND I EE","Per acquisto e trasporto dell'energia","Per acquisto e trasporto dell'energia","Per acquisto e trasporto dell'energia"]
["001991.000309.002008","CE Attività VEND I EE",1991,2008,309,"Invariata","VEND I EE","Altri costi di materie prime, sussidiarie, di consumo e di merci","Altri costi di materie prime, sussidiarie, di consumo e di merci","Altri costi di materie prime, sussidiarie, di consumo e di merci"]
["001991.000308.000416","CE Attività VEND I EE",1991,416,308,"Invariata","VEND I EE","    7) Per servizi","    7) Per servizi","    7) Per servizi"]
["001991.000416.002003","CE Attività VEND I EE",1991,2003,416,"Invariata","VEND I EE","     Per servizi","     Per servizi","     Per servizi"]
["001991.000308.000511","CE Attività VEND I EE",1991,511,308,"Invariata","VEND I EE","    8) Per godimento beni di terzi","    8) Per godimento beni di terzi","    8) Per godimento beni di terzi"]
["001991.000511.002004","CE Attività VEND I EE",1991,2004,511,"Invariata","VEND I EE","          Per godimento beni di terzi","          Per godimento beni di terzi","          Per godimento beni di terzi"]
["001991.000308.000532","CE Attività VEND I EE",1991,532,308,"Invariata","VEND I EE","    9) Per il personale ","    9) Per il personale ","    9) Per il personale "]
["001991.000532.002005","CE Attività VEND I EE",1991,2005,532,"Invariata","VEND I EE","    Per il personale ","    Per il personale ","    Per il personale "]
["001991.000308.000544","CE Attività VEND I EE",1991,544,308,"Invariata","VEND I EE","    10) Ammortamenti e svalutazioni","    10) Ammortamenti e svalutazioni","    10) Ammortamenti e svalutazioni"]
["001991.000544.000545","CE Attività VEND I EE",1991,545,544,"Invariata","VEND I EE","       Ammortamento delle immobilizzazioni immateriali","       Ammortamento delle immobilizzazioni immateriali","       Ammortamento delle immobilizzazioni immateriali"]
["001991.000544.000547","CE Attività VEND I EE",1991,547,544,"Invariata","VEND I EE","       Ammortamento delle immobilizzazioni materiali (ammortamento tecnicoeconomico)","       Ammortamento delle immobilizzazioni materiali (ammortamento tecnicoeconomico)","       Ammortamento delle immobilizzazioni materiali (ammortamento tecnicoeconomico)"]
["001991.000544.000548","CE Attività VEND I EE",1991,548,544,"Invariata","VEND I EE","       Ammortamento delle immobilizzazioni materiali (ammortamento finanziario)","       Ammortamento delle immobilizzazioni materiali (ammortamento finanziario)","       Ammortamento delle immobilizzazioni materiali (ammortamento finanziario)"]
["001991.000544.000549","CE Attività VEND I EE",1991,549,544,"Invariata","VEND I EE","       Altre svalutazioni delle immobilizzazioni","       Altre svalutazioni delle immobilizzazioni","       Altre svalutazioni delle immobilizzazioni"]
["001991.000544.000550","CE Attività VEND I EE",1991,550,544,"Invariata","VEND I EE","       Svalutazione dei crediti compresi nell'attivo circolante e delle disponibilità","       Svalutazione dei crediti compresi nell'attivo circolante e delle disponibilità","       Svalutazione dei crediti compresi nell'attivo circolante e delle disponibilità"]
["001991.000308.000554","CE Attività VEND I EE",1991,554,308,"Invariata","VEND I EE","    12) Accantonamenti per rischi","    12) Accantonamenti per rischi","    12) Accantonamenti per rischi"]
["001991.000554.001135","CE Attività VEND I EE",1991,1135,554,"Invariata","VEND I EE","          - accantonamenti per rischi ","          - accantonamenti per rischi ","          - accantonamenti per rischi "]
["001991.000308.000558","CE Attività VEND I EE",1991,558,308,"Invariata","VEND I EE","    13) Altri accantonamenti","    13) Altri accantonamenti","    13) Altri accantonamenti"]
["001991.000558.000559","CE Attività VEND I EE",1991,559,558,"Invariata","VEND I EE","       Altri accantonamenti","       Altri accantonamenti","       Altri accantonamenti"]
["001991.000308.000560","CE Attività VEND I EE",1991,560,308,"Invariata","VEND I EE","    14) Oneri diversi di gestione","    14) Oneri diversi di gestione","    14) Oneri diversi di gestione"]
["001991.000560.002006","CE Attività VEND I EE",1991,2006,560,"Invariata","VEND I EE","   Oneri diversi di gestione","   Oneri diversi di gestione","   Oneri diversi di gestione"]
["001991.000308.012515","CE Attività VEND I EE",1991,12515,308,"Invariata","VEND I EE","    14-bis ) oneri non ricorrenti","    14-bis ) oneri non ricorrenti","    14-bis ) oneri non ricorrenti"]
[{"$f":"CONCATENATE(TEXT(C228,\"000000\"),\".\",TEXT(E228,\"000000\"),\".\",TEXT(D228,\"000000\"))","v":"001991.000307.000574"},"CE Attività VEND I EE",1991,574,307,"Invariata","VEND I EE","  ACQUISTI INTERNI","  ACQUISTI INTERNI","  ACQUISTI INTERNI"]
["001991.000574.010916","CE Attività VEND I EE",1991,10916,574,"Invariata","VEND I EE","       Acquisto interno di beni e servizi da altre attività a prezzo di mercato","       Acquisto interno di beni e servizi da altre attività a prezzo di mercato","       Acquisto interno di beni e servizi da altre attività a prezzo di mercato"]
["001991.000000.001142","CE Attività VEND I EE",1991,1142,null,"Invariata","VEND I EE","DIFFERENZA TRA VALORE E COSTI DELLA PRODUZIONE","DIFFERENZA TRA VALORE E COSTI DELLA PRODUZIONE","DIFFERENZA TRA VALORE E COSTI DELLA PRODUZIONE"]
["001991.000000.000603","CE Attività VEND I EE",1991,603,null,"Invariata","VEND I EE","   COSTI INDIRETTI","   COSTI INDIRETTI","   COSTI INDIRETTI"]
["001991.000603.000605","CE Attività VEND I EE",1991,605,603,"Invariata","VEND I EE","       Costi attribuiti dalle funzioni operative condivise","       Costi attribuiti dalle funzioni operative condivise","       Costi attribuiti dalle funzioni operative condivise"]
["001991.000605.000608","CE Attività VEND I EE",1991,608,605,"Invariata","VEND I EE","       Funzione operativa condivisa di misura tra attività di settori diversi o tra attività diverse del settore idrico","       Funzione operativa condivisa di misura tra attività di settori diversi o tra attività diverse del settore idrico","       Funzione operativa condivisa di misura tra attività di settori diversi o tra attività diverse del settore idrico"]
["001991.000605.000610","CE Attività VEND I EE",1991,610,605,"Invariata","VEND I EE","          Funzione operativa condivisa di cartografia elettronica","          Funzione operativa condivisa di cartografia elettronica","          Funzione operativa condivisa di cartografia elettronica"]
["001991.000605.010937","CE Attività VEND I EE",1991,10937,605,"Invariata","VEND I EE","       Funzione operativa condivisa commerciale, di vendita e gestione clientela del settore elettrico","       Funzione operativa condivisa commerciale, di vendita e gestione clientela del settore elettrico","       Funzione operativa condivisa commerciale, di vendita e gestione clientela del settore elettrico"]
["001991.000605.010938","CE Attività VEND I EE",1991,10938,605,"Invariata","VEND I EE","       Funzione operativa condivisa commerciale, di vendita e gestione clientela del settore gas","       Funzione operativa condivisa commerciale, di vendita e gestione clientela del settore gas","       Funzione operativa condivisa commerciale, di vendita e gestione clientela del settore gas"]
["001991.000605.010939","CE Attività VEND I EE",1991,10939,605,"Invariata","VEND I EE","       Funzione operativa condivisa commerciale, di vendita e gestione clientela comune al settore elettrico e gas","       Funzione operativa condivisa commerciale, di vendita e gestione clientela comune al settore elettrico e gas","       Funzione operativa condivisa commerciale, di vendita e gestione clientela comune al settore elettrico e gas"]
["001991.000605.010940","CE Attività VEND I EE",1991,10940,605,"Invariata","VEND I EE","       Funzione operativa condivisa di acquisto di energia elettrica","       Funzione operativa condivisa di acquisto di energia elettrica","       Funzione operativa condivisa di acquisto di energia elettrica"]
["001991.000605.010941","CE Attività VEND I EE",1991,10941,605,"Invariata","VEND I EE","       Funzione operativa condivisa di acquisto di gas","       Funzione operativa condivisa di acquisto di gas","       Funzione operativa condivisa di acquisto di gas"]
["001991.000605.010942","CE Attività VEND I EE",1991,10942,605,"Invariata","VEND I EE","       Funzione operativa condivisa di acquisto comune di energia elettrica e di gas","       Funzione operativa condivisa di acquisto comune di energia elettrica e di gas","       Funzione operativa condivisa di acquisto comune di energia elettrica e di gas"]
["001991.000605.011512","CE Attività VEND I EE",1991,11512,605,"Invariata","VEND I EE","       Funzione operativa condivisa di verifica e controllo","       Funzione operativa condivisa di verifica e controllo","       Funzione operativa condivisa di verifica e controllo"]
["001991.000605.011517","CE Attività VEND I EE",1991,11517,605,"Invariata","VEND I EE","       Funzione operativa condivisa di telecontrollo e ricerca perdite","       Funzione operativa condivisa di telecontrollo e ricerca perdite","       Funzione operativa condivisa di telecontrollo e ricerca perdite"]
["001991.000605.011521","CE Attività VEND I EE",1991,11521,605,"Invariata","VEND I EE","       Funzione operativa condivisa di manutenzione e servizi tecnici","       Funzione operativa condivisa di manutenzione e servizi tecnici","       Funzione operativa condivisa di manutenzione e servizi tecnici"]
["001991.000603.000612","CE Attività VEND I EE",1991,612,603,"Invariata","VEND I EE","       Costi attribuiti dai servizi comuni","       Costi attribuiti dai servizi comuni","       Costi attribuiti dai servizi comuni"]
["001991.000612.002010","CE Attività VEND I EE",1991,2010,612,"Invariata","VEND I EE","          Costi attribuiti dai servizi comuni","          Costi attribuiti dai servizi comuni","          Costi attribuiti dai servizi comuni"]
["001991.000603.010957","CE Attività VEND I EE",1991,10957,603,"Invariata","VEND I EE","       Acquisto interno di beni e servizi da altre attività a costo pieno","       Acquisto interno di beni e servizi da altre attività a costo pieno","       Acquisto interno di beni e servizi da altre attività a costo pieno"]
["001991.000000.001143","CE Attività VEND I EE",1991,1143,null,"Invariata","VEND I EE","COSTI DELLA PRODUZIONE (DIRETTI + INDIRETTI)","COSTI DELLA PRODUZIONE (DIRETTI + INDIRETTI)","COSTI DELLA PRODUZIONE (DIRETTI + INDIRETTI)"]
["001991.000000.002009","CE Attività VEND I EE",1991,2009,null,"Invariata","VEND I EE","DIFFERENZA TRA VALORE E COSTI DELLA PRODUZIONE DOPO TRANSAZIONI INTERNE","DIFFERENZA TRA VALORE E COSTI DELLA PRODUZIONE DOPO TRANSAZIONI INTERNE","DIFFERENZA TRA VALORE E COSTI DELLA PRODUZIONE DOPO TRANSAZIONI INTERNE"]
["001991.000000.001144","CE Attività VEND I EE",1991,1144,null,"Invariata","VEND I EE","DIFFERENZA TRA VALORE E COSTI DELLA PRODUZIONE DOPO TRANSAZIONI INTERNE E ATTRIBUZIONE DEI VALORI RELATIVI ALLE FUNZIONI OPERATIVE CONDIVISE E AI SERVIZI COMUNI","DIFFERENZA TRA VALORE E COSTI DELLA PRODUZIONE DOPO TRANSAZIONI INTERNE E ATTRIBUZIONE DEI VALORI RELATIVI ALLE FUNZIONI OPERATIVE CONDIVISE E AI SERVIZI COMUNI","DIFFERENZA TRA VALORE E COSTI DELLA PRODUZIONE DOPO TRANSAZIONI INTERNE E ATTRIBUZIONE DEI VALORI RELATIVI ALLE FUNZIONI OPERATIVE CONDIVISE E AI SERVIZI COMUNI"]
["100072.000000.000001","CE Attività VEND EE CF SG",100072,1,null,"Invariata","VEND EE CF SG","  A.1) VALORE DELLA PRODUZIONE COMPRENSIVO DELLE VENDITE INTERNE","  A.1) VALORE DELLA PRODUZIONE COMPRENSIVO DELLE VENDITE INTERNE","  A.1) VALORE DELLA PRODUZIONE COMPRENSIVO DELLE VENDITE INTERNE"]
["100072.000001.000002","CE Attività VEND EE CF SG",100072,2,1,"Invariata","VEND EE CF SG","  A) VALORE DELLA PRODUZIONE","  A) VALORE DELLA PRODUZIONE","  A) VALORE DELLA PRODUZIONE"]
["100072.000002.000003","CE Attività VEND EE CF SG",100072,3,2,"Invariata","VEND EE CF SG","    1) Ricavi delle vendite e delle prestazioni","    1) Ricavi delle vendite e delle prestazioni","    1) Ricavi delle vendite e delle prestazioni"]
["100072.000003.001149","CE Attività VEND EE CF SG",100072,1149,3,"Invariata","VEND EE CF SG"," Ricavi dalle vendite e dalle prestazioni"," Ricavi dalle vendite e dalle prestazioni"," Ricavi dalle vendite e dalle prestazioni"]
["100072.000002.000253","CE Attività VEND EE CF SG",100072,253,2,"Invariata","VEND EE CF SG","    2) Variazioni delle rimanenze di prodotti in corso di lavorazione, semilavorati e finiti","    2) Variazioni delle rimanenze di prodotti in corso di lavorazione, semilavorati e finiti","    2) Variazioni delle rimanenze di prodotti in corso di lavorazione, semilavorati e finiti"]
["100072.000253.000254","CE Attività VEND EE CF SG",100072,254,253,"Invariata","VEND EE CF SG","       Variazioni delle rimanenze di prodotti in corso di lavorazione, semilavorati e finiti","       Variazioni delle rimanenze di prodotti in corso di lavorazione, semilavorati e finiti","       Variazioni delle rimanenze di prodotti in corso di lavorazione, semilavorati e finiti"]
["100072.000002.000255","CE Attività VEND EE CF SG",100072,255,2,"Invariata","VEND EE CF SG","    3) Variazioni dei lavori in corso su ordinazioni","    3) Variazioni dei lavori in corso su ordinazioni","    3) Variazioni dei lavori in corso su ordinazioni"]
["100072.000255.000256","CE Attività VEND EE CF SG",100072,256,255,"Invariata","VEND EE CF SG","       Variazioni dei lavori in corso su ordinazione","       Variazioni dei lavori in corso su ordinazione","       Variazioni dei lavori in corso su ordinazione"]
["100072.000002.000257","CE Attività VEND EE CF SG",100072,257,2,"Invariata","VEND EE CF SG","    4) Incrementi di immobilizzazioni per lavori interni ","    4) Incrementi di immobilizzazioni per lavori interni ","    4) Incrementi di immobilizzazioni per lavori interni "]
["100072.000257.011039","CE Attività VEND EE CF SG",100072,11039,257,{"$f":"IF(TRIM(H259)=TRIM(I259),\"Invariata\",IF(H259=\"\",\"Aggiunta\",IF(I259=\"\",\"Eliminata\",\"Modificata\")))","v":"Invariata"},"VEND EE CF SG","  Incrementi di immobilizzazioni per lavori interni","  Incrementi di immobilizzazioni per lavori interni","  Incrementi di immobilizzazioni per lavori interni"]
["100072.000002.011466","CE Attività VEND EE CF SG",100072,11466,2,"Invariata","VEND EE CF SG","    5) Altri ricavi e proventi, con separata indicazione dei contributi in conto esercizio","    5) Altri ricavi e proventi, con separata indicazione dei contributi in conto esercizio","    5) Altri ricavi e proventi, con separata indicazione dei contributi in conto esercizio"]
["100072.011466.011457","CE Attività VEND EE CF SG",100072,11457,11466,"Invariata","VEND EE CF SG","   Altri ricavi e proventi","   Altri ricavi e proventi","   Altri ricavi e proventi"]
["100072.000002.012514","CE Attività VEND EE CF SG",100072,12514,2,"Invariata","VEND EE CF SG","    5-bis) ricavi non ricorrenti","    5-bis) ricavi non ricorrenti","    5-bis) ricavi non ricorrenti"]
["100072.000001.000302","CE Attività VEND EE CF SG",100072,302,1,"Invariata","VEND EE CF SG","  VENDITE INTERNE","  VENDITE INTERNE","  VENDITE INTERNE"]
["100072.000302.000304","CE Attività VEND EE CF SG",100072,304,302,"Invariata","VEND EE CF SG","    Vendita interna di beni e servizi ad altre attività a prezzo di mercato","    Vendita interna di beni e servizi ad altre attività a prezzo di mercato","    Vendita interna di beni e servizi ad altre attività a prezzo di mercato"]
["100072.000302.010968","CE Attività VEND EE CF SG",100072,10968,302,"Invariata","VEND EE CF SG","    Vendita interna di beni e servizi ad altre attività a costo pieno","    Vendita interna di beni e servizi ad altre attività a costo pieno","    Vendita interna di beni e servizi ad altre attività a costo pieno"]
["100072.000000.000307","CE Attività VEND EE CF SG",100072,307,null,"Invariata","VEND EE CF SG","B.1) COSTI DELLA PRODUZIONE COMPRENSIVI DEGLI ACQUISTI INTERNI","B.1) COSTI DELLA PRODUZIONE COMPRENSIVI DEGLI ACQUISTI INTERNI","B.1) COSTI DELLA PRODUZIONE COMPRENSIVI DEGLI ACQUISTI INTERNI"]
["100072.000307.000308","CE Attività VEND EE CF SG",100072,308,307,"Invariata","VEND EE CF SG","  B) COSTI DELLA PRODUZIONE","  B) COSTI DELLA PRODUZIONE","  B) COSTI DELLA PRODUZIONE"]
["100072.000308.000309","CE Attività VEND EE CF SG",100072,309,308,"Invariata","VEND EE CF SG","    6) Per materie prime, sussidiarie, di consumo e di merci (a livello di attività vanno riportati i consumi)","    6) Per materie prime, sussidiarie, di consumo e di merci (a livello di attività vanno riportati i consumi)","    6) Per materie prime, sussidiarie, di consumo e di merci (a livello di attività vanno riportati i consumi)"]
["100072.000309.002007","CE Attività VEND EE CF SG",100072,2007,309,"Invariata","VEND EE CF SG","Per acquisto e trasporto dell'energia","Per acquisto e trasporto dell'energia","Per acquisto e trasporto dell'energia"]
["100072.000309.002008","CE Attività VEND EE CF SG",100072,2008,309,"Invariata","VEND EE CF SG","Altri costi di materie prime, sussidiarie, di consumo e di merci","Altri costi di materie prime, sussidiarie, di consumo e di merci","Altri costi di materie prime, sussidiarie, di consumo e di merci"]
["100072.000308.000416","CE Attività VEND EE CF SG",100072,416,308,"Invariata","VEND EE CF SG","    7) Per servizi","    7) Per servizi","    7) Per servizi"]
["100072.000416.002003","CE Attività VEND EE CF SG",100072,2003,416,"Invariata","VEND EE CF SG","     Per servizi","     Per servizi","     Per servizi"]
["100072.000308.000511","CE Attività VEND EE CF SG",100072,511,308,"Invariata","VEND EE CF SG","    8) Per godimento beni di terzi","    8) Per godimento beni di terzi","    8) Per godimento beni di terzi"]
["100072.000511.002004","CE Attività VEND EE CF SG",100072,2004,511,"Invariata","VEND EE CF SG","          Per godimento beni di terzi","          Per godimento beni di terzi","          Per godimento beni di terzi"]
["100072.000308.000532","CE Attività VEND EE CF SG",100072,532,308,"Invariata","VEND EE CF SG","    9) Per il personale ","    9) Per il personale ","    9) Per il personale "]
["100072.000532.002005","CE Attività VEND EE CF SG",100072,2005,532,"Invariata","VEND EE CF SG","    Per il personale ","    Per il personale ","    Per il personale "]
["100072.000308.000544","CE Attività VEND EE CF SG",100072,544,308,"Invariata","VEND EE CF SG","    10) Ammortamenti e svalutazioni","    10) Ammortamenti e svalutazioni","    10) Ammortamenti e svalutazioni"]
["100072.000544.000545","CE Attività VEND EE CF SG",100072,545,544,"Invariata","VEND EE CF SG","       Ammortamento delle immobilizzazioni immateriali","       Ammortamento delle immobilizzazioni immateriali","       Ammortamento delle immobilizzazioni immateriali"]
["100072.000544.000547","CE Attività VEND EE CF SG",100072,547,544,"Invariata","VEND EE CF SG","       Ammortamento delle immobilizzazioni materiali (ammortamento tecnicoeconomico)","       Ammortamento delle immobilizzazioni materiali (ammortamento tecnicoeconomico)","       Ammortamento delle immobilizzazioni materiali (ammortamento tecnicoeconomico)"]
["100072.000544.000548","CE Attività VEND EE CF SG",100072,548,544,"Invariata","VEND EE CF SG","       Ammortamento delle immobilizzazioni materiali (ammortamento finanziario)","       Ammortamento delle immobilizzazioni materiali (ammortamento finanziario)","       Ammortamento delle immobilizzazioni materiali (ammortamento finanziario)"]
["100072.000544.000549","CE Attività VEND EE CF SG",100072,549,544,"Invariata","VEND EE CF SG","       Altre svalutazioni delle immobilizzazioni","       Altre svalutazioni delle immobilizzazioni","       Altre svalutazioni delle immobilizzazioni"]
["100072.000544.000550","CE Attività VEND EE CF SG",100072,550,544,"Invariata","VEND EE CF SG","       Svalutazione dei crediti compresi nell'attivo circolante e delle disponibilità","       Svalutazione dei crediti compresi nell'attivo circolante e delle disponibilità","       Svalutazione dei crediti compresi nell'attivo circolante e delle disponibilità"]
["100072.000308.000554","CE Attività VEND EE CF SG",100072,554,308,"Invariata","VEND EE CF SG","    12) Accantonamenti per rischi","    12) Accantonamenti per rischi","    12) Accantonamenti per rischi"]
["100072.000554.001135","CE Attività VEND EE CF SG",100072,1135,554,"Invariata","VEND EE CF SG","          - accantonamenti per rischi ","          - accantonamenti per rischi ","          - accantonamenti per rischi "]
["100072.000308.000558","CE Attività VEND EE CF SG",100072,558,308,"Invariata","VEND EE CF SG","    13) Altri accantonamenti","    13) Altri accantonamenti","    13) Altri accantonamenti"]
["100072.000558.000559","CE Attività VEND EE CF SG",100072,559,558,"Invariata","VEND EE CF SG","       Altri accantonamenti","       Altri accantonamenti","       Altri accantonamenti"]
["100072.000308.000560","CE Attività VEND EE CF SG",100072,560,308,"Invariata","VEND EE CF SG","    14) Oneri diversi di gestione","    14) Oneri diversi di gestione","    14) Oneri diversi di gestione"]
["100072.000560.002006","CE Attività VEND EE CF SG",100072,2006,560,"Invariata","VEND EE CF SG","   Oneri diversi di gestione","   Oneri diversi di gestione","   Oneri diversi di gestione"]
["100072.000308.012515","CE Attività VEND EE CF SG",100072,12515,308,"Invariata","VEND EE CF SG","    14-bis ) oneri non ricorrenti","    14-bis ) oneri non ricorrenti","    14-bis ) oneri non ricorrenti"]
["100072.000307.000574","CE Attività VEND EE CF SG",100072,574,307,"Invariata","VEND EE CF SG","  ACQUISTI INTERNI","  ACQUISTI INTERNI","  ACQUISTI INTERNI"]
["100072.000574.010916","CE Attività VEND EE CF SG",100072,10916,574,"Invariata","VEND EE CF SG","       Acquisto interno di beni e servizi da altre attività a prezzo di mercato","       Acquisto interno di beni e servizi da altre attività a prezzo di mercato","       Acquisto interno di beni e servizi da altre attività a prezzo di mercato"]
[{"$f":"CONCATENATE(TEXT(C292,\"000000\"),\".\",TEXT(E292,\"000000\"),\".\",TEXT(D292,\"000000\"))","v":"100072.000000.001142"},"CE Attività VEND EE CF SG",100072,1142,null,"Invariata","VEND EE CF SG","DIFFERENZA TRA VALORE E COSTI DELLA PRODUZIONE","DIFFERENZA TRA VALORE E COSTI DELLA PRODUZIONE","DIFFERENZA TRA VALORE E COSTI DELLA PRODUZIONE"]
["100072.000000.000603","CE Attività VEND EE CF SG",100072,603,null,"Invariata","VEND EE CF SG","   COSTI INDIRETTI","   COSTI INDIRETTI","   COSTI INDIRETTI"]
["100072.000603.000605","CE Attività VEND EE CF SG",100072,605,603,"Invariata","VEND EE CF SG","       Costi attribuiti dalle funzioni operative condivise","       Costi attribuiti dalle funzioni operative condivise","       Costi attribuiti dalle funzioni operative condivise"]
["100072.000605.000608","CE Attività VEND EE CF SG",100072,608,605,"Invariata","VEND EE CF SG","       Funzione operativa condivisa di misura tra attività di settori diversi o tra attività diverse del settore idrico","       Funzione operativa condivisa di misura tra attività di settori diversi o tra attività diverse del settore idrico","       Funzione operativa condivisa di misura tra attività di settori diversi o tra attività diverse del settore idrico"]
["100072.000605.000610","CE Attività VEND EE CF SG",100072,610,605,"Invariata","VEND EE CF SG","          Funzione operativa condivisa di cartografia elettronica","          Funzione operativa condivisa di cartografia elettronica","          Funzione operativa condivisa di cartografia elettronica"]
["100072.000605.010937","CE Attività VEND EE CF SG",100072,10937,605,"Invariata","VEND EE CF SG","       Funzione operativa condivisa commerciale, di vendita e gestione clientela del settore elettrico","       Funzione operativa condivisa commerciale, di vendita e gestione clientela del settore elettrico","       Funzione operativa condivisa commerciale, di vendita e gestione clientela del settore elettrico"]
["100072.000605.010938","CE Attività VEND EE CF SG",100072,10938,605,"Invariata","VEND EE CF SG","       Funzione operativa condivisa commerciale, di vendita e gestione clientela del settore gas","       Funzione operativa condivisa commerciale, di vendita e gestione clientela del settore gas","       Funzione operativa condivisa commerciale, di vendita e gestione clientela del settore gas"]
["100072.000605.010939","CE Attività VEND EE CF SG",100072,10939,605,"Invariata","VEND EE CF SG","       Funzione operativa condivisa commerciale, di vendita e gestione clientela comune al settore elettrico e gas","       Funzione operativa condivisa commerciale, di vendita e gestione clientela comune al settore elettrico e gas","       Funzione operativa condivisa commerciale, di vendita e gestione clientela comune al settore elettrico e gas"]
["100072.000605.010940","CE Attività VEND EE CF SG",100072,10940,605,"Invariata","VEND EE CF SG","       Funzione operativa condivisa di acquisto di energia elettrica","       Funzione operativa condivisa di acquisto di energia elettrica","       Funzione operativa condivisa di acquisto di energia elettrica"]
["100072.000605.010941","CE Attività VEND EE CF SG",100072,10941,605,"Invariata","VEND EE CF SG","       Funzione operativa condivisa di acquisto di gas","       Funzione operativa condivisa di acquisto di gas","       Funzione operativa condivisa di acquisto di gas"]
["100072.000605.010942","CE Attività VEND EE CF SG",100072,10942,605,"Invariata","VEND EE CF SG","       Funzione operativa condivisa di acquisto comune di energia elettrica e di gas","       Funzione operativa condivisa di acquisto comune di energia elettrica e di gas","       Funzione operativa condivisa di acquisto comune di energia elettrica e di gas"]
["100072.000605.011512","CE Attività VEND EE CF SG",100072,11512,605,"Invariata","VEND EE CF SG","       Funzione operativa condivisa di verifica e controllo","       Funzione operativa condivisa di verifica e controllo","       Funzione operativa condivisa di verifica e controllo"]
["100072.000605.011517","CE Attività VEND EE CF SG",100072,11517,605,"Invariata","VEND EE CF SG","       Funzione operativa condivisa di telecontrollo e ricerca perdite","       Funzione operativa condivisa di telecontrollo e ricerca perdite","       Funzione operativa condivisa di telecontrollo e ricerca perdite"]
["100072.000605.011521","CE Attività VEND EE CF SG",100072,11521,605,"Invariata","VEND EE CF SG","       Funzione operativa condivisa di manutenzione e servizi tecnici","       Funzione operativa condivisa di manutenzione e servizi tecnici","       Funzione operativa condivisa di manutenzione e servizi tecnici"]
["100072.000603.000612","CE Attività VEND EE CF SG",100072,612,603,"Invariata","VEND EE CF SG","       Costi attribuiti dai servizi comuni","       Costi attribuiti dai servizi comuni","       Costi attribuiti dai servizi comuni"]
["100072.000612.002010","CE Attività VEND EE CF SG",100072,2010,612,"Invariata","VEND EE CF SG","          Costi attribuiti dai servizi comuni","          Costi attribuiti dai servizi comuni","          Costi attribuiti dai servizi comuni"]
["100072.000603.010957","CE Attività VEND EE CF SG",100072,10957,603,"Invariata","VEND EE CF SG","       Acquisto interno di beni e servizi da altre attività a costo pieno","       Acquisto interno di beni e servizi da altre attività a costo pieno","       Acquisto interno di beni e servizi da altre attività a costo pieno"]
["100072.000000.001143","CE Attività VEND EE CF SG",100072,1143,null,"Invariata","VEND EE CF SG","COSTI DELLA PRODUZIONE (DIRETTI + INDIRETTI)","COSTI DELLA PRODUZIONE (DIRETTI + INDIRETTI)","COSTI DELLA PRODUZIONE (DIRETTI + INDIRETTI)"]
["100072.000000.002009","CE Attività VEND EE CF SG",100072,2009,null,"Invariata","VEND EE CF SG","DIFFERENZA TRA VALORE E COSTI DELLA PRODUZIONE DOPO TRANSAZIONI INTERNE","DIFFERENZA TRA VALORE E COSTI DELLA PRODUZIONE DOPO TRANSAZIONI INTERNE","DIFFERENZA TRA VALORE E COSTI DELLA PRODUZIONE DOPO TRANSAZIONI INTERNE"]
["100072.000000.001144","CE Attività VEND EE CF SG",100072,1144,null,"Invariata","VEND EE CF SG","DIFFERENZA TRA VALORE E COSTI DELLA PRODUZIONE DOPO TRANSAZIONI INTERNE E ATTRIBUZIONE DEI VALORI RELATIVI ALLE FUNZIONI OPERATIVE CONDIVISE E AI SERVIZI COMUNI","DIFFERENZA TRA VALORE E COSTI DELLA PRODUZIONE DOPO TRANSAZIONI INTERNE E ATTRIBUZIONE DEI VALORI RELATIVI ALLE FUNZIONI OPERATIVE CONDIVISE E AI SERVIZI COMUNI","DIFFERENZA TRA VALORE E COSTI DELLA PRODUZIONE DOPO TRANSAZIONI INTERNE E ATTRIBUZIONE DEI VALORI RELATIVI ALLE FUNZIONI OPERATIVE CONDIVISE E AI SERVIZI COMUNI"]
["102913.000000.000001","CE Attività VEND EE CF TG",102913,1,null,"Eliminata","VEND EE CF TG","  A.1) VALORE DELLA PRODUZIONE COMPRENSIVO DELLE VENDITE INTERNE"]
["102913.000001.000002","CE Attività VEND EE CF TG",102913,2,1,"Eliminata","VEND EE CF TG","  A) VALORE DELLA PRODUZIONE"]
["102913.000002.000003","CE Attività VEND EE CF TG",102913,3,2,"Eliminata","VEND EE CF TG","    1) Ricavi delle vendite e delle prestazioni"]
["102913.000003.001149","CE Attività VEND EE CF TG",102913,1149,3,"Eliminata","VEND EE CF TG"," Ricavi dalle vendite e dalle prestazioni"]
["102913.000002.000253","CE Attività VEND EE CF TG",102913,253,2,"Eliminata","VEND EE CF TG","    2) Variazioni delle rimanenze di prodotti in corso di lavorazione, semilavorati e finiti"]
["102913.000253.000254","CE Attività VEND EE CF TG",102913,254,253,"Eliminata","VEND EE CF TG","       Variazioni delle rimanenze di prodotti in corso di lavorazione, semilavorati e finiti"]
["102913.000002.000255","CE Attività VEND EE CF TG",102913,255,2,"Eliminata","VEND EE CF TG","    3) Variazioni dei lavori in corso su ordinazioni"]
["102913.000255.000256","CE Attività VEND EE CF TG",102913,256,255,"Eliminata","VEND EE CF TG","       Variazioni dei lavori in corso su ordinazione"]
["102913.000002.000257","CE Attività VEND EE CF TG",102913,257,2,"Eliminata","VEND EE CF TG","    4) Incrementi di immobilizzazioni per lavori interni "]
["102913.000257.011039","CE Attività VEND EE CF TG",102913,11039,257,"Eliminata","VEND EE CF TG","  Incrementi di immobilizzazioni per lavori interni"]
["102913.000002.011466","CE Attività VEND EE CF TG",102913,11466,2,"Eliminata","VEND EE CF TG","    5) Altri ricavi e proventi, con separata indicazione dei contributi in conto esercizio"]
["102913.011466.011457","CE Attività VEND EE CF TG",102913,11457,11466,{"$f":"IF(TRIM(H323)=TRIM(I323),\"Invariata\",IF(H323=\"\",\"Aggiunta\",IF(I323=\"\",\"Eliminata\",\"Modificata\")))","v":"Eliminata"},"VEND EE CF TG","   Altri ricavi e proventi"]
["102913.000002.012514","CE Attività VEND EE CF TG",102913,12514,2,"Eliminata","VEND EE CF TG","    5-bis) ricavi non ricorrenti"]
["102913.000001.000302","CE Attività VEND EE CF TG",102913,302,1,"Eliminata","VEND EE CF TG","  VENDITE INTERNE"]
["102913.000302.000304","CE Attività VEND EE CF TG",102913,304,302,"Eliminata","VEND EE CF TG","    Vendita interna di beni e servizi ad altre attività a prezzo di mercato"]
["102913.000302.010968","CE Attività VEND EE CF TG",102913,10968,302,"Eliminata","VEND EE CF TG","    Vendita interna di beni e servizi ad altre attività a costo pieno"]
["102913.000000.000307","CE Attività VEND EE CF TG",102913,307,null,"Eliminata","VEND EE CF TG","B.1) COSTI DELLA PRODUZIONE COMPRENSIVI DEGLI ACQUISTI INTERNI"]
["102913.000307.000308","CE Attività VEND EE CF TG",102913,308,307,"Eliminata","VEND EE CF TG","  B) COSTI DELLA PRODUZIONE"]
["102913.000308.000309","CE Attività VEND EE CF TG",102913,309,308,"Eliminata","VEND EE CF TG","    6) Per materie prime, sussidiarie, di consumo e di merci (a livello di attività vanno riportati i consumi)"]
["102913.000309.002007","CE Attività VEND EE CF TG",102913,2007,309,"Eliminata","VEND EE CF TG","Per acquisto e trasporto dell'energia"]
["102913.000309.002008","CE Attività VEND EE CF TG",102913,2008,309,"Eliminata","VEND EE CF TG","Altri costi di materie prime, sussidiarie, di consumo e di merci"]
["102913.000308.000416","CE Attività VEND EE CF TG",102913,416,308,"Eliminata","VEND EE CF TG","    7) Per servizi"]
["102913.000416.002003","CE Attività VEND EE CF TG",102913,2003,416,"Eliminata","VEND EE CF TG","     Per servizi"]
["102913.000308.000511","CE Attività VEND EE CF TG",102913,511,308,"Eliminata","VEND EE CF TG","    8) Per godimento beni di terzi"]
["102913.000511.002004","CE Attività VEND EE CF TG",102913,2004,511,"Eliminata","VEND EE CF TG","          Per godimento beni di terzi"]
["102913.000308.000532","CE Attività VEND EE CF TG",102913,532,308,"Eliminata","VEND EE CF TG","    9) Per il personale "]
["102913.000532.002005","CE Attività VEND EE CF TG",102913,2005,532,"Eliminata","VEND EE CF TG","    Per il personale "]
["102913.000308.000544","CE Attività VEND EE CF TG",102913,544,308,"Eliminata","VEND EE CF TG","    10) Ammortamenti e svalutazioni"]
["102913.000544.000545","CE Attività VEND EE CF TG",102913,545,544,"Eliminata","VEND EE CF TG","       Ammortamento delle immobilizzazioni immateriali"]
["102913.000544.000547","CE Attività VEND EE CF TG",102913,547,544,"Eliminata","VEND EE CF TG","       Ammortamento delle immobilizzazioni materiali (ammortamento tecnicoeconomico)"]
["102913.000544.000548","CE Attività VEND EE CF TG",102913,548,544,"Eliminata","VEND EE CF TG","       Ammortamento delle immobilizzazioni materiali (ammortamento finanziario)"]
["102913.000544.000549","CE Attività VEND EE CF TG",102913,549,544,"Eliminata","VEND EE CF TG","       Altre svalutazioni delle immobilizzazioni"]
["102913.000544.000550","CE Attività VEND EE CF TG",102913,550,544,"Eliminata","VEND EE CF TG","       Svalutazione dei crediti compresi nell'attivo circolante e delle disponibilità"]
["102913.000308.000554","CE Attività VEND EE CF TG",102913,554,308,"Eliminata","VEND EE CF TG","    12) Accantonamenti per rischi"]
["102913.000554.001135","CE Attività VEND EE CF TG",102913,1135,554,"Eliminata","VEND EE CF TG","          - accantonamenti per rischi "]
["102913.000308.000558","CE Attività VEND EE CF TG",102913,558,308,"Eliminata","VEND EE CF TG","    13) Altri accantonamenti"]
["102913.000558.000559","CE Attività VEND EE CF TG",102913,559,558,"Eliminata","VEND EE CF TG","       Altri accantonamenti"]
["102913.000308.000560","CE Attività VEND EE CF TG",102913,560,308,"Eliminata","VEND EE CF TG","    14) Oneri diversi di gestione"]
["102913.000560.002006","CE Attività VEND EE CF TG",102913,2006,560,"Eliminata","VEND EE CF TG","   Oneri diversi di gestione"]
["102913.000308.012515","CE Attività VEND EE CF TG",102913,12515,308,"Eliminata","VEND EE CF TG","    14-bis ) oneri non ricorrenti"]
["102913.000307.000574","CE Attività VEND EE CF TG",102913,574,307,"Eliminata","VEND EE CF TG","  ACQUISTI INTERNI"]
["102913.000574.010916","CE Attività VEND EE CF TG",102913,10916,574,"Eliminata","VEND EE CF TG","       Acquisto interno di beni e servizi da altre attività a prezzo di mercato"]
["102913.000000.001142","CE Attività VEND EE CF TG",102913,1142,null,"Eliminata","VEND EE CF TG","DIFFERENZA TRA VALORE E COSTI DELLA PRODUZIONE"]
["102913.000000.000603","CE Attività VEND EE CF TG",102913,603,null,"Eliminata","VEND EE CF TG","   COSTI INDIRETTI"]
[{"$f":"CONCATENATE(TEXT(C356,\"000000\"),\".\",TEXT(E356,\"000000\"),\".\",TEXT(D356,\"000000\"))","v":"102913.000603.000605"},"CE Attività VEND EE CF TG",102913,605,603,"Eliminata","VEND EE CF TG","       Costi attribuiti dalle funzioni operative condivise"]
["102913.000605.000608","CE Attività VEND EE CF TG",102913,608,605,"Eliminata","VEND EE CF TG","       Funzione operativa condivisa di misura tra attività di settori diversi o tra attività diverse del settore idrico"]
["102913.000605.000610","CE Attività VEND EE CF TG",102913,610,605,"Eliminata","VEND EE CF TG","          Funzione operativa condivisa di cartografia elettronica"]
["102913.000605.010937","CE Attività VEND EE CF TG",102913,10937,605,"Eliminata","VEND EE CF TG","       Funzione operativa condivisa commerciale, di vendita e gestione clientela del settore elettrico"]
["102913.000605.010938","CE Attività VEND EE CF TG",102913,10938,605,"Eliminata","VEND EE CF TG","       Funzione operativa condivisa commerciale, di vendita e gestione clientela del settore gas"]
["102913.000605.010939","CE Attività VEND EE CF TG",102913,10939,605,"Eliminata","VEND EE CF TG","       Funzione operativa condivisa commerciale, di vendita e gestione clientela comune al settore elettrico e gas"]
["102913.000605.010940","CE Attività VEND EE CF TG",102913,10940,605,"Eliminata","VEND EE CF TG","       Funzione operativa condivisa di acquisto di energia elettrica"]
["102913.000605.010941","CE Attività VEND EE CF TG",102913,10941,605,"Eliminata","VEND EE CF TG","       Funzione operativa condivisa di acquisto di gas"]
["102913.000605.010942","CE Attività VEND EE CF TG",102913,10942,605,"Eliminata","VEND EE CF TG","       Funzione operativa condivisa di acquisto comune di energia elettrica e di gas"]
["102913.000605.011512","CE Attività VEND EE CF TG",102913,11512,605,"Eliminata","VEND EE CF TG","       Funzione operativa condivisa di verifica e controllo"]
["102913.000605.011517","CE Attività VEND EE CF TG",102913,11517,605,"Eliminata","VEND EE CF TG","       Funzione operativa condivisa di telecontrollo e ricerca perdite"]
["102913.000605.011521","CE Attività VEND EE CF TG",102913,11521,605,"Eliminata","VEND EE CF TG","       Funzione operativa condivisa di manutenzione e servizi tecnici"]
["102913.000603.000612","CE Attività VEND EE CF TG",102913,612,603,"Eliminata","VEND EE CF TG","       Costi attribuiti dai servizi comuni"]
["102913.000612.002010","CE Attività VEND EE CF TG",102913,2010,612,"Eliminata","VEND EE CF TG","          Costi attribuiti dai servizi comuni"]
["102913.000603.010957","CE Attività VEND EE CF TG",102913,10957,603,"Eliminata","VEND EE CF TG","       Acquisto interno di beni e servizi da altre attività a costo pieno"]
["102913.000000.001143","CE Attività VEND EE CF TG",102913,1143,null,"Eliminata","VEND EE CF TG","COSTI DELLA PRODUZIONE (DIRETTI + INDIRETTI)"]
["102913.000000.002009","CE Attività VEND EE CF TG",102913,2009,null,"Eliminata","VEND EE CF TG","DIFFERENZA TRA VALORE E COSTI DELLA PRODUZIONE DOPO TRANSAZIONI INTERNE"]
["102913.000000.001144","CE Attività VEND EE CF TG",102913,1144,null,"Eliminata","VEND EE CF TG","DIFFERENZA TRA VALORE E COSTI DELLA PRODUZIONE DOPO TRANSAZIONI INTERNE E ATTRIBUZIONE DEI VALORI RELATIVI ALLE FUNZIONI OPERATIVE CONDIVISE E AI SERVIZI COMUNI"]
["102971.000000.000001","CE Attività VEND EE CF TG PI",102971,1,null,"Invariata","VEND EE CF TG PI","  A.1) VALORE DELLA PRODUZIONE COMPRENSIVO DELLE VENDITE INTERNE","  A.1) VALORE DELLA PRODUZIONE COMPRENSIVO DELLE VENDITE INTERNE","  A.1) VALORE DELLA PRODUZIONE COMPRENSIVO DELLE VENDITE INTERNE"]
["102971.000001.000002","CE Attività VEND EE CF TG PI",102971,2,1,"Invariata","VEND EE CF TG PI","  A) VALORE DELLA PRODUZIONE","  A) VALORE DELLA PRODUZIONE","  A) VALORE DELLA PRODUZIONE"]
["102971.000002.000003","CE Attività VEND EE CF TG PI",102971,3,2,"Invariata","VEND EE CF TG PI","    1) Ricavi delle vendite e delle prestazioni","    1) Ricavi delle vendite e delle prestazioni","    1) Ricavi delle vendite e delle prestazioni"]
["102971.000003.001149","CE Attività VEND EE CF TG PI",102971,1149,3,"Invariata","VEND EE CF TG PI"," Ricavi dalle vendite e dalle prestazioni"," Ricavi dalle vendite e dalle prestazioni"," Ricavi dalle vendite e dalle prestazioni"]
["102971.000002.000253","CE Attività VEND EE CF TG PI",102971,253,2,"Invariata","VEND EE CF TG PI","    2) Variazioni delle rimanenze di prodotti in corso di lavorazione, semilavorati e finiti","    2) Variazioni delle rimanenze di prodotti in corso di lavorazione, semilavorati e finiti","    2) Variazioni delle rimanenze di prodotti in corso di lavorazione, semilavorati e finiti"]
["102971.000253.000254","CE Attività VEND EE CF TG PI",102971,254,253,"Invariata","VEND EE CF TG PI","       Variazioni delle rimanenze di prodotti in corso di lavorazione, semilavorati e finiti","       Variazioni delle rimanenze di prodotti in corso di lavorazione, semilavorati e finiti","       Variazioni delle rimanenze di prodotti in corso di lavorazione, semilavorati e finiti"]
["102971.000002.000255","CE Attività VEND EE CF TG PI",102971,255,2,"Invariata","VEND EE CF TG PI","    3) Variazioni dei lavori in corso su ordinazioni","    3) Variazioni dei lavori in corso su ordinazioni","    3) Variazioni dei lavori in corso su ordinazioni"]
["102971.000255.000256","CE Attività VEND EE CF TG PI",102971,256,255,"Invariata","VEND EE CF TG PI","       Variazioni dei lavori in corso su ordinazione","       Variazioni dei lavori in corso su ordinazione","       Variazioni dei lavori in corso su ordinazione"]
["102971.000002.000257","CE Attività VEND EE CF TG PI",102971,257,2,"Invariata","VEND EE CF TG PI","    4) Incrementi di immobilizzazioni per lavori interni ","    4) Incrementi di immobilizzazioni per lavori interni ","    4) Incrementi di immobilizzazioni per lavori interni "]
["102971.000257.011039","CE Attività VEND EE CF TG PI",102971,11039,257,"Invariata","VEND EE CF TG PI","  Incrementi di immobilizzazioni per lavori interni","  Incrementi di immobilizzazioni per lavori interni","  Incrementi di immobilizzazioni per lavori interni"]
["102971.000002.011466","CE Attività VEND EE CF TG PI",102971,11466,2,"Invariata","VEND EE CF TG PI","    5) Altri ricavi e proventi, con separata indicazione dei contributi in conto esercizio","    5) Altri ricavi e proventi, con separata indicazione dei contributi in conto esercizio","    5) Altri ricavi e proventi, con separata indicazione dei contributi in conto esercizio"]
["102971.011466.011457","CE Attività VEND EE CF TG PI",102971,11457,11466,"Invariata","VEND EE CF TG PI","   Altri ricavi e proventi","   Altri ricavi e proventi","   Altri ricavi e proventi"]
["102971.000002.012514","CE Attività VEND EE CF TG PI",102971,12514,2,"Invariata","VEND EE CF TG PI","    5-bis) ricavi non ricorrenti","    5-bis) ricavi non ricorrenti","    5-bis) ricavi non ricorrenti"]
["102971.000001.000302","CE Attività VEND EE CF TG PI",102971,302,1,{"$f":"IF(TRIM(H387)=TRIM(I387),\"Invariata\",IF(H387=\"\",\"Aggiunta\",IF(I387=\"\",\"Eliminata\",\"Modificata\")))","v":"Invariata"},"VEND EE CF TG PI","  VENDITE INTERNE","  VENDITE INTERNE","  VENDITE INTERNE"]
["102971.000302.000304","CE Attività VEND EE CF TG PI",102971,304,302,"Invariata","VEND EE CF TG PI","    Vendita interna di beni e servizi ad altre attività a prezzo di mercato","    Vendita interna di beni e servizi ad altre attività a prezzo di mercato","    Vendita interna di beni e servizi ad altre attività a prezzo di mercato"]
["102971.000302.010968","CE Attività VEND EE CF TG PI",102971,10968,302,"Invariata","VEND EE CF TG PI","    Vendita interna di beni e servizi ad altre attività a costo pieno","    Vendita interna di beni e servizi ad altre attività a costo pieno","    Vendita interna di beni e servizi ad altre attività a costo pieno"]
["102971.000000.000307","CE Attività VEND EE CF TG PI",102971,307,null,"Invariata","VEND EE CF TG PI","B.1) COSTI DELLA PRODUZIONE COMPRENSIVI DEGLI ACQUISTI INTERNI","B.1) COSTI DELLA PRODUZIONE COMPRENSIVI DEGLI ACQUISTI INTERNI","B.1) COSTI DELLA PRODUZIONE COMPRENSIVI DEGLI ACQUISTI INTERNI"]
["102971.000307.000308","CE Attività VEND EE CF TG PI",102971,308,307,"Invariata","VEND EE CF TG PI","  B) COSTI DELLA PRODUZIONE","  B) COSTI DELLA PRODUZIONE","  B) COSTI DELLA PRODUZIONE"]
["102971.000308.000309","CE Attività VEND EE CF TG PI",102971,309,308,"Invariata","VEND EE CF TG PI","    6) Per materie prime, sussidiarie, di consumo e di merci (a livello di attività vanno riportati i consumi)","    6) Per materie prime, sussidiarie, di consumo e di merci (a livello di attività vanno riportati i consumi)","    6) Per materie prime, sussidiarie, di consumo e di merci (a livello di attività vanno riportati i consumi)"]
["102971.000309.002007","CE Attività VEND EE CF TG PI",102971,2007,309,"Invariata","VEND EE CF TG PI","Per acquisto e trasporto dell'energia","Per acquisto e trasporto dell'energia","Per acquisto e trasporto dell'energia"]
["102971.000309.002008","CE Attività VEND EE CF TG PI",102971,2008,309,"Invariata","VEND EE CF TG PI","Altri costi di materie prime, sussidiarie, di consumo e di merci","Altri costi di materie prime, sussidiarie, di consumo e di merci","Altri costi di materie prime, sussidiarie, di consumo e di merci"]
["102971.000308.000416","CE Attività VEND EE CF TG PI",102971,416,308,"Invariata","VEND EE CF TG PI","    7) Per servizi","    7) Per servizi","    7) Per servizi"]
["102971.000416.002003","CE Attività VEND EE CF TG PI",102971,2003,416,"Invariata","VEND EE CF TG PI","     Per servizi","     Per servizi","     Per servizi"]
["102971.000308.000511","CE Attività VEND EE CF TG PI",102971,511,308,"Invariata","VEND EE CF TG PI","    8) Per godimento beni di terzi","    8) Per godimento beni di terzi","    8) Per godimento beni di terzi"]
["102971.000511.002004","CE Attività VEND EE CF TG PI",102971,2004,511,"Invariata","VEND EE CF TG PI","          Per godimento beni di terzi","          Per godimento beni di terzi","          Per godimento beni di terzi"]
["102971.000308.000532","CE Attività VEND EE CF TG PI",102971,532,308,"Invariata","VEND EE CF TG PI","    9) Per il personale ","    9) Per il personale ","    9) Per il personale "]
["102971.000532.002005","CE Attività VEND EE CF TG PI",102971,2005,532,"Invariata","VEND EE CF TG PI","    Per il personale ","    Per il personale ","    Per il personale "]
["102971.000308.000544","CE Attività VEND EE CF TG PI",102971,544,308,"Invariata","VEND EE CF TG PI","    10) Ammortamenti e svalutazioni","    10) Ammortamenti e svalutazioni","    10) Ammortamenti e svalutazioni"]
["102971.000544.000545","CE Attività VEND EE CF TG PI",102971,545,544,"Invariata","VEND EE CF TG PI","       Ammortamento delle immobilizzazioni immateriali","       Ammortamento delle immobilizzazioni immateriali","       Ammortamento delle immobilizzazioni immateriali"]
["102971.000544.000547","CE Attività VEND EE CF TG PI",102971,547,544,"Invariata","VEND EE CF TG PI","       Ammortamento delle immobilizzazioni materiali (ammortamento tecnicoeconomico)","       Ammortamento delle immobilizzazioni materiali (ammortamento tecnicoeconomico)","       Ammortamento delle immobilizzazioni materiali (ammortamento tecnicoeconomico)"]
["102971.000544.000548","CE Attività VEND EE CF TG PI",102971,548,544,"Invariata","VEND EE CF TG PI","       Ammortamento delle immobilizzazioni materiali (ammortamento finanziario)","       Ammortamento delle immobilizzazioni materiali (ammortamento finanziario)","       Ammortamento delle immobilizzazioni materiali (ammortamento finanziario)"]
["102971.000544.000549","CE Attività VEND EE CF TG PI",102971,549,544,"Invariata","VEND EE CF TG PI","       Altre svalutazioni delle immobilizzazioni","       Altre svalutazioni delle immobilizzazioni","       Altre svalutazioni delle immobilizzazioni"]
["102971.000544.000550","CE Attività VEND EE CF TG PI",102971,550,544,"Invariata","VEND EE CF TG PI","       Svalutazione dei crediti compresi nell'attivo circolante e delle disponibilità","       Svalutazione dei crediti compresi nell'attivo circolante e delle disponibilità","       Svalutazione dei crediti compresi nell'attivo circolante e delle disponibilità"]
["102971.000308.000554","CE Attività VEND EE CF TG PI",102971,554,308,"Invariata","VEND EE CF TG PI","    12) Accantonamenti per rischi","    12) Accantonamenti per rischi","    12) Accantonamenti per rischi"]
["102971.000554.001135","CE Attività VEND EE CF TG PI",102971,1135,554,"Invariata","VEND EE CF TG PI","          - accantonamenti per rischi ","          - accantonamenti per rischi ","          - accantonamenti per rischi "]
["102971.000308.000558","CE Attività VEND EE CF TG PI",102971,558,308,"Invariata","VEND EE CF TG PI","    13) Altri accantonamenti","    13) Altri accantonamenti","    13) Altri accantonamenti"]
["102971.000558.000559","CE Attività VEND EE CF TG PI",102971,559,558,"Invariata","VEND EE CF TG PI","       Altri accantonamenti","       Altri accantonamenti","       Altri accantonamenti"]
["102971.000308.000560","CE Attività VEND EE CF TG PI",102971,560,308,"Invariata","VEND EE CF TG PI","    14) Oneri diversi di gestione","    14) Oneri diversi di gestione","    14) Oneri diversi di gestione"]
["102971.000560.002006","CE Attività VEND EE CF TG PI",102971,2006,560,"Invariata","VEND EE CF TG PI","   Oneri diversi di gestione","   Oneri diversi di gestione","   Oneri diversi di gestione"]
["102971.000308.012515","CE Attività VEND EE CF TG PI",102971,12515,308,"Invariata","VEND EE CF TG PI","    14-bis ) oneri non ricorrenti","    14-bis ) oneri non ricorrenti","    14-bis ) oneri non ricorrenti"]
["102971.000307.000574","CE Attività VEND EE CF TG PI",102971,574,307,"Invariata","VEND EE CF TG PI","  ACQUISTI INTERNI","  ACQUISTI INTERNI","  ACQUISTI INTERNI"]
["102971.000574.010916","CE Attività VEND EE CF TG PI",102971,10916,574,"Invariata","VEND EE CF TG PI","       Acquisto interno di beni e servizi da altre attività a prezzo di mercato","       Acquisto interno di beni e servizi da altre attività a prezzo di mercato","       Acquisto interno di beni e servizi da altre attività a prezzo di mercato"]
["102971.000000.001142","CE Attività VEND EE CF TG PI",102971,1142,null,"Invariata","VEND EE CF TG PI","DIFFERENZA TRA VALORE E COSTI DELLA PRODUZIONE","DIFFERENZA TRA VALORE E COSTI DELLA PRODUZIONE","DIFFERENZA TRA VALORE E COSTI DELLA PRODUZIONE"]
["102971.000000.000603","CE Attività VEND EE CF TG PI",102971,603,null,"Invariata","VEND EE CF TG PI","   COSTI INDIRETTI","   COSTI INDIRETTI","   COSTI INDIRETTI"]
["102971.000603.000605","CE Attività VEND EE CF TG PI",102971,605,603,"Invariata","VEND EE CF TG PI","       Costi attribuiti dalle funzioni operative condivise","       Costi attribuiti dalle funzioni operative condivise","       Costi attribuiti dalle funzioni operative condivise"]
["102971.000605.000608","CE Attività VEND EE CF TG PI",102971,608,605,"Invariata","VEND EE CF TG PI","       Funzione operativa condivisa di misura tra attività di settori diversi o tra attività diverse del settore idrico","       Funzione operativa condivisa di misura tra attività di settori diversi o tra attività diverse del settore idrico","       Funzione operativa condivisa di misura tra attività di settori diversi o tra attività diverse del settore idrico"]
[{"$f":"CONCATENATE(TEXT(C420,\"000000\"),\".\",TEXT(E420,\"000000\"),\".\",TEXT(D420,\"000000\"))","v":"102971.000605.000610"},"CE Attività VEND EE CF TG PI",102971,610,605,"Invariata","VEND EE CF TG PI","          Funzione operativa condivisa di cartografia elettronica","          Funzione operativa condivisa di cartografia elettronica","          Funzione operativa condivisa di cartografia elettronica"]
["102971.000605.010937","CE Attività VEND EE CF TG PI",102971,10937,605,"Invariata","VEND EE CF TG PI","       Funzione operativa condivisa commerciale, di vendita e gestione clientela del settore elettrico","       Funzione operativa condivisa commerciale, di vendita e gestione clientela del settore elettrico","       Funzione operativa condivisa commerciale, di vendita e gestione clientela del settore elettrico"]
["102971.000605.010938","CE Attività VEND EE CF TG PI",102971,10938,605,"Invariata","VEND EE CF TG PI","       Funzione operativa condivisa commerciale, di vendita e gestione clientela del settore gas","       Funzione operativa condivisa commerciale, di vendita e gestione clientela del settore gas","       Funzione operativa condivisa commerciale, di vendita e gestione clientela del settore gas"]
["102971.000605.010939","CE Attività VEND EE CF TG PI",102971,10939,605,"Invariata","VEND EE CF TG PI","       Funzione operativa condivisa commerciale, di vendita e gestione clientela comune al settore elettrico e gas","       Funzione operativa condivisa commerciale, di vendita e gestione clientela comune al settore elettrico e gas","       Funzione operativa condivisa commerciale, di vendita e gestione clientela comune al settore elettrico e gas"]
["102971.000605.010940","CE Attività VEND EE CF TG PI",102971,10940,605,"Invariata","VEND EE CF TG PI","       Funzione operativa condivisa di acquisto di energia elettrica","       Funzione operativa condivisa di acquisto di energia elettrica","       Funzione operativa condivisa di acquisto di energia elettrica"]
["102971.000605.010941","CE Attività VEND EE CF TG PI",102971,10941,605,"Invariata","VEND EE CF TG PI","       Funzione operativa condivisa di acquisto di gas","       Funzione operativa condivisa di acquisto di gas","       Funzione operativa condivisa di acquisto di gas"]
["102971.000605.010942","CE Attività VEND EE CF TG PI",102971,10942,605,"Invariata","VEND EE CF TG PI","       Funzione operativa condivisa di acquisto comune di energia elettrica e di gas","       Funzione operativa condivisa di acquisto comune di energia elettrica e di gas","       Funzione operativa condivisa di acquisto comune di energia elettrica e di gas"]
["102971.000605.011512","CE Attività VEND EE CF TG PI",102971,11512,605,"Invariata","VEND EE CF TG PI","       Funzione operativa condivisa di verifica e controllo","       Funzione operativa condivisa di verifica e controllo","       Funzione operativa condivisa di verifica e controllo"]
["102971.000605.011517","CE Attività VEND EE CF TG PI",102971,11517,605,"Invariata","VEND EE CF TG PI","       Funzione operativa condivisa di telecontrollo e ricerca perdite","       Funzione operativa condivisa di telecontrollo e ricerca perdite","       Funzione operativa condivisa di telecontrollo e ricerca perdite"]
["102971.000605.011521","CE Attività VEND EE CF TG PI",102971,11521,605,"Invariata","VEND EE CF TG PI","       Funzione operativa condivisa di manutenzione e servizi tecnici","       Funzione operativa condivisa di manutenzione e servizi tecnici","       Funzione operativa condivisa di manutenzione e servizi tecnici"]
["102971.000603.000612","CE Attività VEND EE CF TG PI",102971,612,603,"Invariata","VEND EE CF TG PI","       Costi attribuiti dai servizi comuni","       Costi attribuiti dai servizi comuni","       Costi attribuiti dai servizi comuni"]
["102971.000612.002010","CE Attività VEND EE CF TG PI",102971,2010,612,"Invariata","VEND EE CF TG PI","          Costi attribuiti dai servizi comuni","          Costi attribuiti dai servizi comuni","          Costi attribuiti dai servizi comuni"]
["102971.000603.010957","CE Attività VEND EE CF TG PI",102971,10957,603,"Invariata","VEND EE CF TG PI","       Acquisto interno di beni e servizi da altre attività a costo pieno","       Acquisto interno di beni e servizi da altre attività a costo pieno","       Acquisto interno di beni e servizi da altre attività a costo pieno"]
["102971.000000.001143","CE Attività VEND EE CF TG PI",102971,1143,null,"Invariata","VEND EE CF TG PI","COSTI DELLA PRODUZIONE (DIRETTI + INDIRETTI)","COSTI DELLA PRODUZIONE (DIRETTI + INDIRETTI)","COSTI DELLA PRODUZIONE (DIRETTI + INDIRETTI)"]
["102971.000000.002009","CE Attività VEND EE CF TG PI",102971,2009,null,"Invariata","VEND EE CF TG PI","DIFFERENZA TRA VALORE E COSTI DELLA PRODUZIONE DOPO TRANSAZIONI INTERNE","DIFFERENZA TRA VALORE E COSTI DELLA PRODUZIONE DOPO TRANSAZIONI INTERNE","DIFFERENZA TRA VALORE E COSTI DELLA PRODUZIONE DOPO TRANSAZIONI INTERNE"]
["102971.000000.001144","CE Attività VEND EE CF TG PI",102971,1144,null,"Invariata","VEND EE CF TG PI","DIFFERENZA TRA VALORE E COSTI DELLA PRODUZIONE DOPO TRANSAZIONI INTERNE E ATTRIBUZIONE DEI VALORI RELATIVI ALLE FUNZIONI OPERATIVE CONDIVISE E AI SERVIZI COMUNI","DIFFERENZA TRA VALORE E COSTI DELLA PRODUZIONE DOPO TRANSAZIONI INTERNE E ATTRIBUZIONE DEI VALORI RELATIVI ALLE FUNZIONI OPERATIVE CONDIVISE E AI SERVIZI COMUNI","DIFFERENZA TRA VALORE E COSTI DELLA PRODUZIONE DOPO TRANSAZIONI INTERNE E ATTRIBUZIONE DEI VALORI RELATIVI ALLE FUNZIONI OPERATIVE CONDIVISE E AI SERVIZI COMUNI"]
["103015.000000.000001","CE Attività VEND EE CF TG MI",103015,1,null,"Invariata","VEND EE CF TG MI","  A.1) VALORE DELLA PRODUZIONE COMPRENSIVO DELLE VENDITE INTERNE","  A.1) VALORE DELLA PRODUZIONE COMPRENSIVO DELLE VENDITE INTERNE","  A.1) VALORE DELLA PRODUZIONE COMPRENSIVO DELLE VENDITE INTERNE"]
["103015.000001.000002","CE Attività VEND EE CF TG MI",103015,2,1,"Invariata","VEND EE CF TG MI","  A) VALORE DELLA PRODUZIONE","  A) VALORE DELLA PRODUZIONE","  A) VALORE DELLA PRODUZIONE"]
["103015.000002.000003","CE Attività VEND EE CF TG MI",103015,3,2,"Invariata","VEND EE CF TG MI","    1) Ricavi delle vendite e delle prestazioni","    1) Ricavi delle vendite e delle prestazioni","    1) Ricavi delle vendite e delle prestazioni"]
["103015.000003.001149","CE Attività VEND EE CF TG MI",103015,1149,3,"Invariata","VEND EE CF TG MI"," Ricavi dalle vendite e dalle prestazioni"," Ricavi dalle vendite e dalle prestazioni"," Ricavi dalle vendite e dalle prestazioni"]
["103015.000002.000253","CE Attività VEND EE CF TG MI",103015,253,2,"Invariata","VEND EE CF TG MI","    2) Variazioni delle rimanenze di prodotti in corso di lavorazione, semilavorati e finiti","    2) Variazioni delle rimanenze di prodotti in corso di lavorazione, semilavorati e finiti","    2) Variazioni delle rimanenze di prodotti in corso di lavorazione, semilavorati e finiti"]
["103015.000253.000254","CE Attività VEND EE CF TG MI",103015,254,253,"Invariata","VEND EE CF TG MI","       Variazioni delle rimanenze di prodotti in corso di lavorazione, semilavorati e finiti","       Variazioni delle rimanenze di prodotti in corso di lavorazione, semilavorati e finiti","       Variazioni delle rimanenze di prodotti in corso di lavorazione, semilavorati e finiti"]
["103015.000002.000255","CE Attività VEND EE CF TG MI",103015,255,2,"Invariata","VEND EE CF TG MI","    3) Variazioni dei lavori in corso su ordinazioni","    3) Variazioni dei lavori in corso su ordinazioni","    3) Variazioni dei lavori in corso su ordinazioni"]
["103015.000255.000256","CE Attività VEND EE CF TG MI",103015,256,255,"Invariata","VEND EE CF TG MI","       Variazioni dei lavori in corso su ordinazione","       Variazioni dei lavori in corso su ordinazione","       Variazioni dei lavori in corso su ordinazione"]
["103015.000002.000257","CE Attività VEND EE CF TG MI",103015,257,2,"Invariata","VEND EE CF TG MI","    4) Incrementi di immobilizzazioni per lavori interni ","    4) Incrementi di immobilizzazioni per lavori interni ","    4) Incrementi di immobilizzazioni per lavori interni "]
["103015.000257.011039","CE Attività VEND EE CF TG MI",103015,11039,257,"Invariata","VEND EE CF TG MI","  Incrementi di immobilizzazioni per lavori interni","  Incrementi di immobilizzazioni per lavori interni","  Incrementi di immobilizzazioni per lavori interni"]
["103015.000002.011466","CE Attività VEND EE CF TG MI",103015,11466,2,"Invariata","VEND EE CF TG MI","    5) Altri ricavi e proventi, con separata indicazione dei contributi in conto esercizio","    5) Altri ricavi e proventi, con separata indicazione dei contributi in conto esercizio","    5) Altri ricavi e proventi, con separata indicazione dei contributi in conto esercizio"]
["103015.011466.011457","CE Attività VEND EE CF TG MI",103015,11457,11466,"Invariata","VEND EE CF TG MI","   Altri ricavi e proventi","   Altri ricavi e proventi","   Altri ricavi e proventi"]
["103015.000002.012514","CE Attività VEND EE CF TG MI",103015,12514,2,"Invariata","VEND EE CF TG MI","    5-bis) ricavi non ricorrenti","    5-bis) ricavi non ricorrenti","    5-bis) ricavi non ricorrenti"]
["103015.000001.000302","CE Attività VEND EE CF TG MI",103015,302,1,"Invariata","VEND EE CF TG MI","  VENDITE INTERNE","  VENDITE INTERNE","  VENDITE INTERNE"]
["103015.000302.000304","CE Attività VEND EE CF TG MI",103015,304,302,"Invariata","VEND EE CF TG MI","    Vendita interna di beni e servizi ad altre attività a prezzo di mercato","    Vendita interna di beni e servizi ad altre attività a prezzo di mercato","    Vendita interna di beni e servizi ad altre attività a prezzo di mercato"]
["103015.000302.010968","CE Attività VEND EE CF TG MI",103015,10968,302,{"$f":"IF(TRIM(H451)=TRIM(I451),\"Invariata\",IF(H451=\"\",\"Aggiunta\",IF(I451=\"\",\"Eliminata\",\"Modificata\")))","v":"Invariata"},"VEND EE CF TG MI","    Vendita interna di beni e servizi ad altre attività a costo pieno","    Vendita interna di beni e servizi ad altre attività a costo pieno","    Vendita interna di beni e servizi ad altre attività a costo pieno"]
["103015.000000.000307","CE Attività VEND EE CF TG MI",103015,307,null,"Invariata","VEND EE CF TG MI","B.1) COSTI DELLA PRODUZIONE COMPRENSIVI DEGLI ACQUISTI INTERNI","B.1) COSTI DELLA PRODUZIONE COMPRENSIVI DEGLI ACQUISTI INTERNI","B.1) COSTI DELLA PRODUZIONE COMPRENSIVI DEGLI ACQUISTI INTERNI"]
["103015.000307.000308","CE Attività VEND EE CF TG MI",103015,308,307,"Invariata","VEND EE CF TG MI","  B) COSTI DELLA PRODUZIONE","  B) COSTI DELLA PRODUZIONE","  B) COSTI DELLA PRODUZIONE"]
["103015.000308.000309","CE Attività VEND EE CF TG MI",103015,309,308,"Invariata","VEND EE CF TG MI","    6) Per materie prime, sussidiarie, di consumo e di merci (a livello di attività vanno riportati i consumi)","    6) Per materie prime, sussidiarie, di consumo e di merci (a livello di attività vanno riportati i consumi)","    6) Per materie prime, sussidiarie, di consumo e di merci (a livello di attività vanno riportati i consumi)"]
["103015.000309.002007","CE Attività VEND EE CF TG MI",103015,2007,309,"Invariata","VEND EE CF TG MI","Per acquisto e trasporto dell'energia","Per acquisto e trasporto dell'energia","Per acquisto e trasporto dell'energia"]
["103015.000309.002008","CE Attività VEND EE CF TG MI",103015,2008,309,"Invariata","VEND EE CF TG MI","Altri costi di materie prime, sussidiarie, di consumo e di merci","Altri costi di materie prime, sussidiarie, di consumo e di merci","Altri costi di materie prime, sussidiarie, di consumo e di merci"]
["103015.000308.000416","CE Attività VEND EE CF TG MI",103015,416,308,"Invariata","VEND EE CF TG MI","    7) Per servizi","    7) Per servizi","    7) Per servizi"]
["103015.000416.002003","CE Attività VEND EE CF TG MI",103015,2003,416,"Invariata","VEND EE CF TG MI","     Per servizi","     Per servizi","     Per servizi"]
["103015.000308.000511","CE Attività VEND EE CF TG MI",103015,511,308,"Invariata","VEND EE CF TG MI","    8) Per godimento beni di terzi","    8) Per godimento beni di terzi","    8) Per godimento beni di terzi"]
["103015.000511.002004","CE Attività VEND EE CF TG MI",103015,2004,511,"Invariata","VEND EE CF TG MI","          Per godimento beni di terzi","          Per godimento beni di terzi","          Per godimento beni di terzi"]
["103015.000308.000532","CE Attività VEND EE CF TG MI",103015,532,308,"Invariata","VEND EE CF TG MI","    9) Per il personale ","    9) Per il personale ","    9) Per il personale "]
["103015.000532.002005","CE Attività VEND EE CF TG MI",103015,2005,532,"Invariata","VEND EE CF TG MI","    Per il personale ","    Per il personale ","    Per il personale "]
["103015.000308.000544","CE Attività VEND EE CF TG MI",103015,544,308,"Invariata","VEND EE CF TG MI","    10) Ammortamenti e svalutazioni","    10) Ammortamenti e svalutazioni","    10) Ammortamenti e svalutazioni"]
["103015.000544.000545","CE Attività VEND EE CF TG MI",103015,545,544,"Invariata","VEND EE CF TG MI","       Ammortamento delle immobilizzazioni immateriali","       Ammortamento delle immobilizzazioni immateriali","       Ammortamento delle immobilizzazioni immateriali"]
["103015.000544.000547","CE Attività VEND EE CF TG MI",103015,547,544,"Invariata","VEND EE CF TG MI","       Ammortamento delle immobilizzazioni materiali (ammortamento tecnicoeconomico)","       Ammortamento delle immobilizzazioni materiali (ammortamento tecnicoeconomico)","       Ammortamento delle immobilizzazioni materiali (ammortamento tecnicoeconomico)"]
["103015.000544.000548","CE Attività VEND EE CF TG MI",103015,548,544,"Invariata","VEND EE CF TG MI","       Ammortamento delle immobilizzazioni materiali (ammortamento finanziario)","       Ammortamento delle immobilizzazioni materiali (ammortamento finanziario)","       Ammortamento delle immobilizzazioni materiali (ammortamento finanziario)"]
["103015.000544.000549","CE Attività VEND EE CF TG MI",103015,549,544,"Invariata","VEND EE CF TG MI","       Altre svalutazioni delle immobilizzazioni","       Altre svalutazioni delle immobilizzazioni","       Altre svalutazioni delle immobilizzazioni"]
["103015.000544.000550","CE Attività VEND EE CF TG MI",103015,550,544,"Invariata","VEND EE CF TG MI","       Svalutazione dei crediti compresi nell'attivo circolante e delle disponibilità","       Svalutazione dei crediti compresi nell'attivo circolante e delle disponibilità","       Svalutazione dei crediti compresi nell'attivo circolante e delle disponibilità"]
["103015.000308.000554","CE Attività VEND EE CF TG MI",103015,554,308,"Invariata","VEND EE CF TG MI","    12) Accantonamenti per rischi","    12) Accantonamenti per rischi","    12) Accantonamenti per rischi"]
["103015.000554.001135","CE Attività VEND EE CF TG MI",103015,1135,554,"Invariata","VEND EE CF TG MI","          - accantonamenti per rischi ","          - accantonamenti per rischi ","          - accantonamenti per rischi "]
["103015.000308.000558","CE Attività VEND EE CF TG MI",103015,558,308,"Invariata","VEND EE CF TG MI","    13) Altri accantonamenti","    13) Altri accantonamenti","    13) Altri accantonamenti"]
["103015.000558.000559","CE Attività VEND EE CF TG MI",103015,559,558,"Invariata","VEND EE CF TG MI","       Altri accantonamenti","       Altri accantonamenti","       Altri accantonamenti"]
["103015.000308.000560","CE Attività VEND EE CF TG MI",103015,560,308,"Invariata","VEND EE CF TG MI","    14) Oneri diversi di gestione","    14) Oneri diversi di gestione","    14) Oneri diversi di gestione"]
["103015.000560.002006","CE Attività VEND EE CF TG MI",103015,2006,560,"Invariata","VEND EE CF TG MI","   Oneri diversi di gestione","   Oneri diversi di gestione","   Oneri diversi di gestione"]
["103015.000308.012515","CE Attività VEND EE CF TG MI",103015,12515,308,"Invariata","VEND EE CF TG MI","    14-bis ) oneri non ricorrenti","    14-bis ) oneri non ricorrenti","    14-bis ) oneri non ricorrenti"]
["103015.000307.000574","CE Attività VEND EE CF TG MI",103015,574,307,"Invariata","VEND EE CF TG MI","  ACQUISTI INTERNI","  ACQUISTI INTERNI","  ACQUISTI INTERNI"]
["103015.000574.010916","CE Attività VEND EE CF TG MI",103015,10916,574,"Invariata","VEND EE CF TG MI","       Acquisto interno di beni e servizi da altre attività a prezzo di mercato","       Acquisto interno di beni e servizi da altre attività a prezzo di mercato","       Acquisto interno di beni e servizi da altre attività a prezzo di mercato"]
["103015.000000.001142","CE Attività VEND EE CF TG MI",103015,1142,null,"Invariata","VEND EE CF TG MI","DIFFERENZA TRA VALORE E COSTI DELLA PRODUZIONE","DIFFERENZA TRA VALORE E COSTI DELLA PRODUZIONE","DIFFERENZA TRA VALORE E COSTI DELLA PRODUZIONE"]
["103015.000000.000603","CE Attività VEND EE CF TG MI",103015,603,null,"Invariata","VEND EE CF TG MI","   COSTI INDIRETTI","   COSTI INDIRETTI","   COSTI INDIRETTI"]
["103015.000603.000605","CE Attività VEND EE CF TG MI",103015,605,603,"Invariata","VEND EE CF TG MI","       Costi attribuiti dalle funzioni operative condivise","       Costi attribuiti dalle funzioni operative condivise","       Costi attribuiti dalle funzioni operative condivise"]
["103015.000605.000608","CE Attività VEND EE CF TG MI",103015,608,605,"Invariata","VEND EE CF TG MI","       Funzione operativa condivisa di misura tra attività di settori diversi o tra attività diverse del settore idrico","       Funzione operativa condivisa di misura tra attività di settori diversi o tra attività diverse del settore idrico","       Funzione operativa condivisa di misura tra attività di settori diversi o tra attività diverse del settore idrico"]
["103015.000605.000610","CE Attività VEND EE CF TG MI",103015,610,605,"Invariata","VEND EE CF TG MI","          Funzione operativa condivisa di cartografia elettronica","          Funzione operativa condivisa di cartografia elettronica","          Funzione operativa condivisa di cartografia elettronica"]
["103015.000605.010937","CE Attività VEND EE CF TG MI",103015,10937,605,"Invariata","VEND EE CF TG MI","       Funzione operativa condivisa commerciale, di vendita e gestione clientela del settore elettrico","       Funzione operativa condivisa commerciale, di vendita e gestione clientela del settore elettrico","       Funzione operativa condivisa commerciale, di vendita e gestione clientela del settore elettrico"]
[{"$f":"CONCATENATE(TEXT(C484,\"000000\"),\".\",TEXT(E484,\"000000\"),\".\",TEXT(D484,\"000000\"))","v":"103015.000605.010938"},"CE Attività VEND EE CF TG MI",103015,10938,605,"Invariata","VEND EE CF TG MI","       Funzione operativa condivisa commerciale, di vendita e gestione clientela del settore gas","       Funzione operativa condivisa commerciale, di vendita e gestione clientela del settore gas","       Funzione operativa condivisa commerciale, di vendita e gestione clientela del settore gas"]
["103015.000605.010939","CE Attività VEND EE CF TG MI",103015,10939,605,"Invariata","VEND EE CF TG MI","       Funzione operativa condivisa commerciale, di vendita e gestione clientela comune al settore elettrico e gas","       Funzione operativa condivisa commerciale, di vendita e gestione clientela comune al settore elettrico e gas","       Funzione operativa condivisa commerciale, di vendita e gestione clientela comune al settore elettrico e gas"]
["103015.000605.010940","CE Attività VEND EE CF TG MI",103015,10940,605,"Invariata","VEND EE CF TG MI","       Funzione operativa condivisa di acquisto di energia elettrica","       Funzione operativa condivisa di acquisto di energia elettrica","       Funzione operativa condivisa di acquisto di energia elettrica"]
["103015.000605.010941","CE Attività VEND EE CF TG MI",103015,10941,605,"Invariata","VEND EE CF TG MI","       Funzione operativa condivisa di acquisto di gas","       Funzione operativa condivisa di acquisto di gas","       Funzione operativa condivisa di acquisto di gas"]
["103015.000605.010942","CE Attività VEND EE CF TG MI",103015,10942,605,"Invariata","VEND EE CF TG MI","       Funzione operativa condivisa di acquisto comune di energia elettrica e di gas","       Funzione operativa condivisa di acquisto comune di energia elettrica e di gas","       Funzione operativa condivisa di acquisto comune di energia elettrica e di gas"]
["103015.000605.011512","CE Attività VEND EE CF TG MI",103015,11512,605,"Invariata","VEND EE CF TG MI","       Funzione operativa condivisa di verifica e controllo","       Funzione operativa condivisa di verifica e controllo","       Funzione operativa condivisa di verifica e controllo"]
["103015.000605.011517","CE Attività VEND EE CF TG MI",103015,11517,605,"Invariata","VEND EE CF TG MI","       Funzione operativa condivisa di telecontrollo e ricerca perdite","       Funzione operativa condivisa di telecontrollo e ricerca perdite","       Funzione operativa condivisa di telecontrollo e ricerca perdite"]
["103015.000605.011521","CE Attività VEND EE CF TG MI",103015,11521,605,"Invariata","VEND EE CF TG MI","       Funzione operativa condivisa di manutenzione e servizi tecnici","       Funzione operativa condivisa di manutenzione e servizi tecnici","       Funzione operativa condivisa di manutenzione e servizi tecnici"]
["103015.000603.000612","CE Attività VEND EE CF TG MI",103015,612,603,"Invariata","VEND EE CF TG MI","       Costi attribuiti dai servizi comuni","       Costi attribuiti dai servizi comuni","       Costi attribuiti dai servizi comuni"]
["103015.000612.002010","CE Attività VEND EE CF TG MI",103015,2010,612,"Invariata","VEND EE CF TG MI","          Costi attribuiti dai servizi comuni","          Costi attribuiti dai servizi comuni","          Costi attribuiti dai servizi comuni"]
["103015.000603.010957","CE Attività VEND EE CF TG MI",103015,10957,603,"Invariata","VEND EE CF TG MI","       Acquisto interno di beni e servizi da altre attività a costo pieno","       Acquisto interno di beni e servizi da altre attività a costo pieno","       Acquisto interno di beni e servizi da altre attività a costo pieno"]
["103015.000000.001143","CE Attività VEND EE CF TG MI",103015,1143,null,"Invariata","VEND EE CF TG MI","COSTI DELLA PRODUZIONE (DIRETTI + INDIRETTI)","COSTI DELLA PRODUZIONE (DIRETTI + INDIRETTI)","COSTI DELLA PRODUZIONE (DIRETTI + INDIRETTI)"]
["103015.000000.002009","CE Attività VEND EE CF TG MI",103015,2009,null,"Invariata","VEND EE CF TG MI","DIFFERENZA TRA VALORE E COSTI DELLA PRODUZIONE DOPO TRANSAZIONI INTERNE","DIFFERENZA TRA VALORE E COSTI DELLA PRODUZIONE DOPO TRANSAZIONI INTERNE","DIFFERENZA TRA VALORE E COSTI DELLA PRODUZIONE DOPO TRANSAZIONI INTERNE"]
["103015.000000.001144","CE Attività VEND EE CF TG MI",103015,1144,null,"Invariata","VEND EE CF TG MI","DIFFERENZA TRA VALORE E COSTI DELLA PRODUZIONE DOPO TRANSAZIONI INTERNE E ATTRIBUZIONE DEI VALORI RELATIVI ALLE FUNZIONI OPERATIVE CONDIVISE E AI SERVIZI COMUNI","DIFFERENZA TRA VALORE E COSTI DELLA PRODUZIONE DOPO TRANSAZIONI INTERNE E ATTRIBUZIONE DEI VALORI RELATIVI ALLE FUNZIONI OPERATIVE CONDIVISE E AI SERVIZI COMUNI","DIFFERENZA TRA VALORE E COSTI DELLA PRODUZIONE DOPO TRANSAZIONI INTERNE E ATTRIBUZIONE DEI VALORI RELATIVI ALLE FUNZIONI OPERATIVE CONDIVISE E AI SERVIZI COMUNI"]
["100087.000000.000001","CE Attività VEND EE CF MT",100087,1,null,"Invariata","VEND EE CF MT","  A.1) VALORE DELLA PRODUZIONE COMPRENSIVO DELLE VENDITE INTERNE","  A.1) VALORE DELLA PRODUZIONE COMPRENSIVO DELLE VENDITE INTERNE","  A.1) VALORE DELLA PRODUZIONE COMPRENSIVO DELLE VENDITE INTERNE"]
["100087.000001.000002","CE Attività VEND EE CF MT",100087,2,1,"Invariata","VEND EE CF MT","  A) VALORE DELLA PRODUZIONE","  A) VALORE DELLA PRODUZIONE","  A) VALORE DELLA PRODUZIONE"]
["100087.000002.000003","CE Attività VEND EE CF MT",100087,3,2,"Invariata","VEND EE CF MT","    1) Ricavi delle vendite e delle prestazioni","    1) Ricavi delle vendite e delle prestazioni","    1) Ricavi delle vendite e delle prestazioni"]
["100087.000003.001149","CE Attività VEND EE CF MT",100087,1149,3,"Invariata","VEND EE CF MT"," Ricavi dalle vendite e dalle prestazioni"," Ricavi dalle vendite e dalle prestazioni"," Ricavi dalle vendite e dalle prestazioni"]
["100087.000002.000253","CE Attività VEND EE CF MT",100087,253,2,"Invariata","VEND EE CF MT","    2) Variazioni delle rimanenze di prodotti in corso di lavorazione, semilavorati e finiti","    2) Variazioni delle rimanenze di prodotti in corso di lavorazione, semilavorati e finiti","    2) Variazioni delle rimanenze di prodotti in corso di lavorazione, semilavorati e finiti"]
["100087.000253.000254","CE Attività VEND EE CF MT",100087,254,253,"Invariata","VEND EE CF MT","       Variazioni delle rimanenze di prodotti in corso di lavorazione, semilavorati e finiti","       Variazioni delle rimanenze di prodotti in corso di lavorazione, semilavorati e finiti","       Variazioni delle rimanenze di prodotti in corso di lavorazione, semilavorati e finiti"]
["100087.000002.000255","CE Attività VEND EE CF MT",100087,255,2,"Invariata","VEND EE CF MT","    3) Variazioni dei lavori in corso su ordinazioni","    3) Variazioni dei lavori in corso su ordinazioni","    3) Variazioni dei lavori in corso su ordinazioni"]
["100087.000255.000256","CE Attività VEND EE CF MT",100087,256,255,"Invariata","VEND EE CF MT","       Variazioni dei lavori in corso su ordinazione","       Variazioni dei lavori in corso su ordinazione","       Variazioni dei lavori in corso su ordinazione"]
["100087.000002.000257","CE Attività VEND EE CF MT",100087,257,2,"Invariata","VEND EE CF MT","    4) Incrementi di immobilizzazioni per lavori interni ","    4) Incrementi di immobilizzazioni per lavori interni ","    4) Incrementi di immobilizzazioni per lavori interni "]
["100087.000257.011039","CE Attività VEND EE CF MT",100087,11039,257,"Invariata","VEND EE CF MT","  Incrementi di immobilizzazioni per lavori interni","  Incrementi di immobilizzazioni per lavori interni","  Incrementi di immobilizzazioni per lavori interni"]
["100087.000002.011466","CE Attività VEND EE CF MT",100087,11466,2,"Invariata","VEND EE CF MT","    5) Altri ricavi e proventi, con separata indicazione dei contributi in conto esercizio","    5) Altri ricavi e proventi, con separata indicazione dei contributi in conto esercizio","    5) Altri ricavi e proventi, con separata indicazione dei contributi in conto esercizio"]
["100087.011466.011457","CE Attività VEND EE CF MT",100087,11457,11466,"Invariata","VEND EE CF MT","   Altri ricavi e proventi","   Altri ricavi e proventi","   Altri ricavi e proventi"]
["100087.000002.012514","CE Attività VEND EE CF MT",100087,12514,2,"Invariata","VEND EE CF MT","    5-bis) ricavi non ricorrenti","    5-bis) ricavi non ricorrenti","    5-bis) ricavi non ricorrenti"]
["100087.000001.000302","CE Attività VEND EE CF MT",100087,302,1,"Invariata","VEND EE CF MT","  VENDITE INTERNE","  VENDITE INTERNE","  VENDITE INTERNE"]
["100087.000302.000304","CE Attività VEND EE CF MT",100087,304,302,"Invariata","VEND EE CF MT","    Vendita interna di beni e servizi ad altre attività a prezzo di mercato","    Vendita interna di beni e servizi ad altre attività a prezzo di mercato","    Vendita interna di beni e servizi ad altre attività a prezzo di mercato"]
["100087.000302.010968","CE Attività VEND EE CF MT",100087,10968,302,"Invariata","VEND EE CF MT","    Vendita interna di beni e servizi ad altre attività a costo pieno","    Vendita interna di beni e servizi ad altre attività a costo pieno","    Vendita interna di beni e servizi ad altre attività a costo pieno"]
["100087.000000.000307","CE Attività VEND EE CF MT",100087,307,null,"Invariata","VEND EE CF MT","B.1) COSTI DELLA PRODUZIONE COMPRENSIVI DEGLI ACQUISTI INTERNI","B.1) COSTI DELLA PRODUZIONE COMPRENSIVI DEGLI ACQUISTI INTERNI","B.1) COSTI DELLA PRODUZIONE COMPRENSIVI DEGLI ACQUISTI INTERNI"]
["100087.000307.000308","CE Attività VEND EE CF MT",100087,308,307,{"$f":"IF(TRIM(H515)=TRIM(I515),\"Invariata\",IF(H515=\"\",\"Aggiunta\",IF(I515=\"\",\"Eliminata\",\"Modificata\")))","v":"Invariata"},"VEND EE CF MT","  B) COSTI DELLA PRODUZIONE","  B) COSTI DELLA PRODUZIONE","  B) COSTI DELLA PRODUZIONE"]
["100087.000308.000309","CE Attività VEND EE CF MT",100087,309,308,"Invariata","VEND EE CF MT","    6) Per materie prime, sussidiarie, di consumo e di merci (a livello di attività vanno riportati i consumi)","    6) Per materie prime, sussidiarie, di consumo e di merci (a livello di attività vanno riportati i consumi)","    6) Per materie prime, sussidiarie, di consumo e di merci (a livello di attività vanno riportati i consumi)"]
["100087.000309.002007","CE Attività VEND EE CF MT",100087,2007,309,"Invariata","VEND EE CF MT","Per acquisto e trasporto dell'energia","Per acquisto e trasporto dell'energia","Per acquisto e trasporto dell'energia"]
["100087.000309.002008","CE Attività VEND EE CF MT",100087,2008,309,"Invariata","VEND EE CF MT","Altri costi di materie prime, sussidiarie, di consumo e di merci","Altri costi di materie prime, sussidiarie, di consumo e di merci","Altri costi di materie prime, sussidiarie, di consumo e di merci"]
["100087.000308.000416","CE Attività VEND EE CF MT",100087,416,308,"Invariata","VEND EE CF MT","    7) Per servizi","    7) Per servizi","    7) Per servizi"]
["100087.000416.002003","CE Attività VEND EE CF MT",100087,2003,416,"Invariata","VEND EE CF MT","     Per servizi","     Per servizi","     Per servizi"]
["100087.000308.000511","CE Attività VEND EE CF MT",100087,511,308,"Invariata","VEND EE CF MT","    8) Per godimento beni di terzi","    8) Per godimento beni di terzi","    8) Per godimento beni di terzi"]
["100087.000511.002004","CE Attività VEND EE CF MT",100087,2004,511,"Invariata","VEND EE CF MT","          Per godimento beni di terzi","          Per godimento beni di terzi","          Per godimento beni di terzi"]
["100087.000308.000532","CE Attività VEND EE CF MT",100087,532,308,"Invariata","VEND EE CF MT","    9) Per il personale ","    9) Per il personale ","    9) Per il personale "]
["100087.000532.002005","CE Attività VEND EE CF MT",100087,2005,532,"Invariata","VEND EE CF MT","    Per il personale ","    Per il personale ","    Per il personale "]
["100087.000308.000544","CE Attività VEND EE CF MT",100087,544,308,"Invariata","VEND EE CF MT","    10) Ammortamenti e svalutazioni","    10) Ammortamenti e svalutazioni","    10) Ammortamenti e svalutazioni"]
["100087.000544.000545","CE Attività VEND EE CF MT",100087,545,544,"Invariata","VEND EE CF MT","       Ammortamento delle immobilizzazioni immateriali","       Ammortamento delle immobilizzazioni immateriali","       Ammortamento delle immobilizzazioni immateriali"]
["100087.000544.000547","CE Attività VEND EE CF MT",100087,547,544,"Invariata","VEND EE CF MT","       Ammortamento delle immobilizzazioni materiali (ammortamento tecnicoeconomico)","       Ammortamento delle immobilizzazioni materiali (ammortamento tecnicoeconomico)","       Ammortamento delle immobilizzazioni materiali (ammortamento tecnicoeconomico)"]
["100087.000544.000548","CE Attività VEND EE CF MT",100087,548,544,"Invariata","VEND EE CF MT","       Ammortamento delle immobilizzazioni materiali (ammortamento finanziario)","       Ammortamento delle immobilizzazioni materiali (ammortamento finanziario)","       Ammortamento delle immobilizzazioni materiali (ammortamento finanziario)"]
["100087.000544.000549","CE Attività VEND EE CF MT",100087,549,544,"Invariata","VEND EE CF MT","       Altre svalutazioni delle immobilizzazioni","       Altre svalutazioni delle immobilizzazioni","       Altre svalutazioni delle immobilizzazioni"]
["100087.000544.000550","CE Attività VEND EE CF MT",100087,550,544,"Invariata","VEND EE CF MT","       Svalutazione dei crediti compresi nell'attivo circolante e delle disponibilità","       Svalutazione dei crediti compresi nell'attivo circolante e delle disponibilità","       Svalutazione dei crediti compresi nell'attivo circolante e delle disponibilità"]
["100087.000308.000554","CE Attività VEND EE CF MT",100087,554,308,"Invariata","VEND EE CF MT","    12) Accantonamenti per rischi","    12) Accantonamenti per rischi","    12) Accantonamenti per rischi"]
["100087.000554.001135","CE Attività VEND EE CF MT",100087,1135,554,"Invariata","VEND EE CF MT","          - accantonamenti per rischi ","          - accantonamenti per rischi ","          - accantonamenti per rischi "]
["100087.000308.000558","CE Attività VEND EE CF MT",100087,558,308,"Invariata","VEND EE CF MT","    13) Altri accantonamenti","    13) Altri accantonamenti","    13) Altri accantonamenti"]
["100087.000558.000559","CE Attività VEND EE CF MT",100087,559,558,"Invariata","VEND EE CF MT","       Altri accantonamenti","       Altri accantonamenti","       Altri accantonamenti"]
["100087.000308.000560","CE Attività VEND EE CF MT",100087,560,308,"Invariata","VEND EE CF MT","    14) Oneri diversi di gestione","    14) Oneri diversi di gestione","    14) Oneri diversi di gestione"]
["100087.000560.002006","CE Attività VEND EE CF MT",100087,2006,560,"Invariata","VEND EE CF MT","   Oneri diversi di gestione","   Oneri diversi di gestione","   Oneri diversi di gestione"]
["100087.000308.012515","CE Attività VEND EE CF MT",100087,12515,308,"Invariata","VEND EE CF MT","    14-bis ) oneri non ricorrenti","    14-bis ) oneri non ricorrenti","    14-bis ) oneri non ricorrenti"]
["100087.000307.000574","CE Attività VEND EE CF MT",100087,574,307,"Invariata","VEND EE CF MT","  ACQUISTI INTERNI","  ACQUISTI INTERNI","  ACQUISTI INTERNI"]
["100087.000574.010916","CE Attività VEND EE CF MT",100087,10916,574,"Invariata","VEND EE CF MT","       Acquisto interno di beni e servizi da altre attività a prezzo di mercato","       Acquisto interno di beni e servizi da altre attività a prezzo di mercato","       Acquisto interno di beni e servizi da altre attività a prezzo di mercato"]
["100087.000000.001142","CE Attività VEND EE CF MT",100087,1142,null,"Invariata","VEND EE CF MT","DIFFERENZA TRA VALORE E COSTI DELLA PRODUZIONE","DIFFERENZA TRA VALORE E COSTI DELLA PRODUZIONE","DIFFERENZA TRA VALORE E COSTI DELLA PRODUZIONE"]
["100087.000000.000603","CE Attività VEND EE CF MT",100087,603,null,"Invariata","VEND EE CF MT","   COSTI INDIRETTI","   COSTI INDIRETTI","   COSTI INDIRETTI"]
["100087.000603.000605","CE Attività VEND EE CF MT",100087,605,603,"Invariata","VEND EE CF MT","       Costi attribuiti dalle funzioni operative condivise","       Costi attribuiti dalle funzioni operative condivise","       Costi attribuiti dalle funzioni operative condivise"]
["100087.000605.000608","CE Attività VEND EE CF MT",100087,608,605,"Invariata","VEND EE CF MT","       Funzione operativa condivisa di misura tra attività di settori diversi o tra attività diverse del settore idrico","       Funzione operativa condivisa di misura tra attività di settori diversi o tra attività diverse del settore idrico","       Funzione operativa condivisa di misura tra attività di settori diversi o tra attività diverse del settore idrico"]
["100087.000605.000610","CE Attività VEND EE CF MT",100087,610,605,"Invariata","VEND EE CF MT","          Funzione operativa condivisa di cartografia elettronica","          Funzione operativa condivisa di cartografia elettronica","          Funzione operativa condivisa di cartografia elettronica"]
["100087.000605.010937","CE Attività VEND EE CF MT",100087,10937,605,"Invariata","VEND EE CF MT","       Funzione operativa condivisa commerciale, di vendita e gestione clientela del settore elettrico","       Funzione operativa condivisa commerciale, di vendita e gestione clientela del settore elettrico","       Funzione operativa condivisa commerciale, di vendita e gestione clientela del settore elettrico"]
["100087.000605.010938","CE Attività VEND EE CF MT",100087,10938,605,"Invariata","VEND EE CF MT","       Funzione operativa condivisa commerciale, di vendita e gestione clientela del settore gas","       Funzione operativa condivisa commerciale, di vendita e gestione clientela del settore gas","       Funzione operativa condivisa commerciale, di vendita e gestione clientela del settore gas"]
["100087.000605.010939","CE Attività VEND EE CF MT",100087,10939,605,"Invariata","VEND EE CF MT","       Funzione operativa condivisa commerciale, di vendita e gestione clientela comune al settore elettrico e gas","       Funzione operativa condivisa commerciale, di vendita e gestione clientela comune al settore elettrico e gas","       Funzione operativa condivisa commerciale, di vendita e gestione clientela comune al settore elettrico e gas"]
[{"$f":"CONCATENATE(TEXT(C548,\"000000\"),\".\",TEXT(E548,\"000000\"),\".\",TEXT(D548,\"000000\"))","v":"100087.000605.010940"},"CE Attività VEND EE CF MT",100087,10940,605,"Invariata","VEND EE CF MT","       Funzione operativa condivisa di acquisto di energia elettrica","       Funzione operativa condivisa di acquisto di energia elettrica","       Funzione operativa condivisa di acquisto di energia elettrica"]
["100087.000605.010941","CE Attività VEND EE CF MT",100087,10941,605,"Invariata","VEND EE CF MT","       Funzione operativa condivisa di acquisto di gas","       Funzione operativa condivisa di acquisto di gas","       Funzione operativa condivisa di acquisto di gas"]
["100087.000605.010942","CE Attività VEND EE CF MT",100087,10942,605,"Invariata","VEND EE CF MT","       Funzione operativa condivisa di acquisto comune di energia elettrica e di gas","       Funzione operativa condivisa di acquisto comune di energia elettrica e di gas","       Funzione operativa condivisa di acquisto comune di energia elettrica e di gas"]
["100087.000605.011512","CE Attività VEND EE CF MT",100087,11512,605,"Invariata","VEND EE CF MT","       Funzione operativa condivisa di verifica e controllo","       Funzione operativa condivisa di verifica e controllo","       Funzione operativa condivisa di verifica e controllo"]
["100087.000605.011517","CE Attività VEND EE CF MT",100087,11517,605,"Invariata","VEND EE CF MT","       Funzione operativa condivisa di telecontrollo e ricerca perdite","       Funzione operativa condivisa di telecontrollo e ricerca perdite","       Funzione operativa condivisa di telecontrollo e ricerca perdite"]
["100087.000605.011521","CE Attività VEND EE CF MT",100087,11521,605,"Invariata","VEND EE CF MT","       Funzione operativa condivisa di manutenzione e servizi tecnici","       Funzione operativa condivisa di manutenzione e servizi tecnici","       Funzione operativa condivisa di manutenzione e servizi tecnici"]
["100087.000603.000612","CE Attività VEND EE CF MT",100087,612,603,"Invariata","VEND EE CF MT","       Costi attribuiti dai servizi comuni","       Costi attribuiti dai servizi comuni","       Costi attribuiti dai servizi comuni"]
["100087.000612.002010","CE Attività VEND EE CF MT",100087,2010,612,"Invariata","VEND EE CF MT","          Costi attribuiti dai servizi comuni","          Costi attribuiti dai servizi comuni","          Costi attribuiti dai servizi comuni"]
["100087.000603.010957","CE Attività VEND EE CF MT",100087,10957,603,"Invariata","VEND EE CF MT","       Acquisto interno di beni e servizi da altre attività a costo pieno","       Acquisto interno di beni e servizi da altre attività a costo pieno","       Acquisto interno di beni e servizi da altre attività a costo pieno"]
["100087.000000.001143","CE Attività VEND EE CF MT",100087,1143,null,"Invariata","VEND EE CF MT","COSTI DELLA PRODUZIONE (DIRETTI + INDIRETTI)","COSTI DELLA PRODUZIONE (DIRETTI + INDIRETTI)","COSTI DELLA PRODUZIONE (DIRETTI + INDIRETTI)"]
["100087.000000.002009","CE Attività VEND EE CF MT",100087,2009,null,"Invariata","VEND EE CF MT","DIFFERENZA TRA VALORE E COSTI DELLA PRODUZIONE DOPO TRANSAZIONI INTERNE","DIFFERENZA TRA VALORE E COSTI DELLA PRODUZIONE DOPO TRANSAZIONI INTERNE","DIFFERENZA TRA VALORE E COSTI DELLA PRODUZIONE DOPO TRANSAZIONI INTERNE"]
["100087.000000.001144","CE Attività VEND EE CF MT",100087,1144,null,"Invariata","VEND EE CF MT","DIFFERENZA TRA VALORE E COSTI DELLA PRODUZIONE DOPO TRANSAZIONI INTERNE E ATTRIBUZIONE DEI VALORI RELATIVI ALLE FUNZIONI OPERATIVE CONDIVISE E AI SERVIZI COMUNI","DIFFERENZA TRA VALORE E COSTI DELLA PRODUZIONE DOPO TRANSAZIONI INTERNE E ATTRIBUZIONE DEI VALORI RELATIVI ALLE FUNZIONI OPERATIVE CONDIVISE E AI SERVIZI COMUNI","DIFFERENZA TRA VALORE E COSTI DELLA PRODUZIONE DOPO TRANSAZIONI INTERNE E ATTRIBUZIONE DEI VALORI RELATIVI ALLE FUNZIONI OPERATIVE CONDIVISE E AI SERVIZI COMUNI"]
["100669.000000.000001","CE Attività VEND CL LIB EE",100669,1,null,"Invariata","VEND CL LIB EE","  A.1) VALORE DELLA PRODUZIONE COMPRENSIVO DELLE VENDITE INTERNE","  A.1) VALORE DELLA PRODUZIONE COMPRENSIVO DELLE VENDITE INTERNE","  A.1) VALORE DELLA PRODUZIONE COMPRENSIVO DELLE VENDITE INTERNE"]
["100669.000001.000002","CE Attività VEND CL LIB EE",100669,2,1,"Invariata","VEND CL LIB EE","  A) VALORE DELLA PRODUZIONE","  A) VALORE DELLA PRODUZIONE","  A) VALORE DELLA PRODUZIONE"]
["100669.000002.000003","CE Attività VEND CL LIB EE",100669,3,2,"Invariata","VEND CL LIB EE","    1) Ricavi delle vendite e delle prestazioni","    1) Ricavi delle vendite e delle prestazioni","    1) Ricavi delle vendite e delle prestazioni"]
["100669.000003.001149","CE Attività VEND CL LIB EE",100669,1149,3,"Invariata","VEND CL LIB EE"," Ricavi dalle vendite e dalle prestazioni"," Ricavi dalle vendite e dalle prestazioni"," Ricavi dalle vendite e dalle prestazioni"]
["100669.000002.000253","CE Attività VEND CL LIB EE",100669,253,2,"Invariata","VEND CL LIB EE","    2) Variazioni delle rimanenze di prodotti in corso di lavorazione, semilavorati e finiti","    2) Variazioni delle rimanenze di prodotti in corso di lavorazione, semilavorati e finiti","    2) Variazioni delle rimanenze di prodotti in corso di lavorazione, semilavorati e finiti"]
["100669.000253.000254","CE Attività VEND CL LIB EE",100669,254,253,"Invariata","VEND CL LIB EE","       Variazioni delle rimanenze di prodotti in corso di lavorazione, semilavorati e finiti","       Variazioni delle rimanenze di prodotti in corso di lavorazione, semilavorati e finiti","       Variazioni delle rimanenze di prodotti in corso di lavorazione, semilavorati e finiti"]
["100669.000002.000255","CE Attività VEND CL LIB EE",100669,255,2,"Invariata","VEND CL LIB EE","    3) Variazioni dei lavori in corso su ordinazioni","    3) Variazioni dei lavori in corso su ordinazioni","    3) Variazioni dei lavori in corso su ordinazioni"]
["100669.000255.000256","CE Attività VEND CL LIB EE",100669,256,255,"Invariata","VEND CL LIB EE","       Variazioni dei lavori in corso su ordinazione","       Variazioni dei lavori in corso su ordinazione","       Variazioni dei lavori in corso su ordinazione"]
["100669.000002.000257","CE Attività VEND CL LIB EE",100669,257,2,"Invariata","VEND CL LIB EE","    4) Incrementi di immobilizzazioni per lavori interni ","    4) Incrementi di immobilizzazioni per lavori interni ","    4) Incrementi di immobilizzazioni per lavori interni "]
["100669.000257.011039","CE Attività VEND CL LIB EE",100669,11039,257,"Invariata","VEND CL LIB EE","  Incrementi di immobilizzazioni per lavori interni","  Incrementi di immobilizzazioni per lavori interni","  Incrementi di immobilizzazioni per lavori interni"]
["100669.000002.011466","CE Attività VEND CL LIB EE",100669,11466,2,"Invariata","VEND CL LIB EE","    5) Altri ricavi e proventi, con separata indicazione dei contributi in conto esercizio","    5) Altri ricavi e proventi, con separata indicazione dei contributi in conto esercizio","    5) Altri ricavi e proventi, con separata indicazione dei contributi in conto esercizio"]
["100669.011466.011457","CE Attività VEND CL LIB EE",100669,11457,11466,"Invariata","VEND CL LIB EE","   Altri ricavi e proventi","   Altri ricavi e proventi","   Altri ricavi e proventi"]
["100669.000002.012514","CE Attività VEND CL LIB EE",100669,12514,2,"Invariata","VEND CL LIB EE","    5-bis) ricavi non ricorrenti","    5-bis) ricavi non ricorrenti","    5-bis) ricavi non ricorrenti"]
["100669.000001.000302","CE Attività VEND CL LIB EE",100669,302,1,"Invariata","VEND CL LIB EE","  VENDITE INTERNE","  VENDITE INTERNE","  VENDITE INTERNE"]
["100669.000302.000304","CE Attività VEND CL LIB EE",100669,304,302,"Invariata","VEND CL LIB EE","    Vendita interna di beni e servizi ad altre attività a prezzo di mercato","    Vendita interna di beni e servizi ad altre attività a prezzo di mercato","    Vendita interna di beni e servizi ad altre attività a prezzo di mercato"]
["100669.000302.010968","CE Attività VEND CL LIB EE",100669,10968,302,"Invariata","VEND CL LIB EE","    Vendita interna di beni e servizi ad altre attività a costo pieno","    Vendita interna di beni e servizi ad altre attività a costo pieno","    Vendita interna di beni e servizi ad altre attività a costo pieno"]
["100669.000000.000307","CE Attività VEND CL LIB EE",100669,307,null,"Invariata","VEND CL LIB EE","B.1) COSTI DELLA PRODUZIONE COMPRENSIVI DEGLI ACQUISTI INTERNI","B.1) COSTI DELLA PRODUZIONE COMPRENSIVI DEGLI ACQUISTI INTERNI","B.1) COSTI DELLA PRODUZIONE COMPRENSIVI DEGLI ACQUISTI INTERNI"]
["100669.000307.000308","CE Attività VEND CL LIB EE",100669,308,307,"Invariata","VEND CL LIB EE","  B) COSTI DELLA PRODUZIONE","  B) COSTI DELLA PRODUZIONE","  B) COSTI DELLA PRODUZIONE"]
["100669.000308.000309","CE Attività VEND CL LIB EE",100669,309,308,"Invariata","VEND CL LIB EE","    6) Per materie prime, sussidiarie, di consumo e di merci (a livello di attività vanno riportati i consumi)","    6) Per materie prime, sussidiarie, di consumo e di merci (a livello di attività vanno riportati i consumi)","    6) Per materie prime, sussidiarie, di consumo e di merci (a livello di attività vanno riportati i consumi)"]
["100669.000309.002007","CE Attività VEND CL LIB EE",100669,2007,309,{"$f":"IF(TRIM(H579)=TRIM(I579),\"Invariata\",IF(H579=\"\",\"Aggiunta\",IF(I579=\"\",\"Eliminata\",\"Modificata\")))","v":"Invariata"},"VEND CL LIB EE","Per acquisto e trasporto dell'energia","Per acquisto e trasporto dell'energia","Per acquisto e trasporto dell'energia"]
["100669.000309.002008","CE Attività VEND CL LIB EE",100669,2008,309,"Invariata","VEND CL LIB EE","Altri costi di materie prime, sussidiarie, di consumo e di merci","Altri costi di materie prime, sussidiarie, di consumo e di merci","Altri costi di materie prime, sussidiarie, di consumo e di merci"]
["100669.000308.000416","CE Attività VEND CL LIB EE",100669,416,308,"Invariata","VEND CL LIB EE","    7) Per servizi","    7) Per servizi","    7) Per servizi"]
["100669.000416.002003","CE Attività VEND CL LIB EE",100669,2003,416,"Invariata","VEND CL LIB EE","     Per servizi","     Per servizi","     Per servizi"]
["100669.000308.000511","CE Attività VEND CL LIB EE",100669,511,308,"Invariata","VEND CL LIB EE","    8) Per godimento beni di terzi","    8) Per godimento beni di terzi","    8) Per godimento beni di terzi"]
["100669.000511.002004","CE Attività VEND CL LIB EE",100669,2004,511,"Invariata","VEND CL LIB EE","          Per godimento beni di terzi","          Per godimento beni di terzi","          Per godimento beni di terzi"]
["100669.000308.000532","CE Attività VEND CL LIB EE",100669,532,308,"Invariata","VEND CL LIB EE","    9) Per il personale ","    9) Per il personale ","    9) Per il personale "]
["100669.000532.002005","CE Attività VEND CL LIB EE",100669,2005,532,"Invariata","VEND CL LIB EE","    Per il personale ","    Per il personale ","    Per il personale "]
["100669.000308.000544","CE Attività VEND CL LIB EE",100669,544,308,"Invariata","VEND CL LIB EE","    10) Ammortamenti e svalutazioni","    10) Ammortamenti e svalutazioni","    10) Ammortamenti e svalutazioni"]
["100669.000544.000545","CE Attività VEND CL LIB EE",100669,545,544,"Invariata","VEND CL LIB EE","       Ammortamento delle immobilizzazioni immateriali","       Ammortamento delle immobilizzazioni immateriali","       Ammortamento delle immobilizzazioni immateriali"]
["100669.000544.000547","CE Attività VEND CL LIB EE",100669,547,544,"Invariata","VEND CL LIB EE","       Ammortamento delle immobilizzazioni materiali (ammortamento tecnicoeconomico)","       Ammortamento delle immobilizzazioni materiali (ammortamento tecnicoeconomico)","       Ammortamento delle immobilizzazioni materiali (ammortamento tecnicoeconomico)"]
["100669.000544.000548","CE Attività VEND CL LIB EE",100669,548,544,"Invariata","VEND CL LIB EE","       Ammortamento delle immobilizzazioni materiali (ammortamento finanziario)","       Ammortamento delle immobilizzazioni materiali (ammortamento finanziario)","       Ammortamento delle immobilizzazioni materiali (ammortamento finanziario)"]
["100669.000544.000549","CE Attività VEND CL LIB EE",100669,549,544,"Invariata","VEND CL LIB EE","       Altre svalutazioni delle immobilizzazioni","       Altre svalutazioni delle immobilizzazioni","       Altre svalutazioni delle immobilizzazioni"]
["100669.000544.000550","CE Attività VEND CL LIB EE",100669,550,544,"Invariata","VEND CL LIB EE","       Svalutazione dei crediti compresi nell'attivo circolante e delle disponibilità","       Svalutazione dei crediti compresi nell'attivo circolante e delle disponibilità","       Svalutazione dei crediti compresi nell'attivo circolante e delle disponibilità"]
["100669.000308.000554","CE Attività VEND CL LIB EE",100669,554,308,"Invariata","VEND CL LIB EE","    12) Accantonamenti per rischi","    12) Accantonamenti per rischi","    12) Accantonamenti per rischi"]
["100669.000554.001135","CE Attività VEND CL LIB EE",100669,1135,554,"Invariata","VEND CL LIB EE","          - accantonamenti per rischi ","          - accantonamenti per rischi ","          - accantonamenti per rischi "]
["100669.000308.000558","CE Attività VEND CL LIB EE",100669,558,308,"Invariata","VEND CL LIB EE","    13) Altri accantonamenti","    13) Altri accantonamenti","    13) Altri accantonamenti"]
["100669.000558.000559","CE Attività VEND CL LIB EE",100669,559,558,"Invariata","VEND CL LIB EE","       Altri accantonamenti","       Altri accantonamenti","       Altri accantonamenti"]
["100669.000308.000560","CE Attività VEND CL LIB EE",100669,560,308,"Invariata","VEND CL LIB EE","    14) Oneri diversi di gestione","    14) Oneri diversi di gestione","    14) Oneri diversi di gestione"]
["100669.000560.002006","CE Attività VEND CL LIB EE",100669,2006,560,"Invariata","VEND CL LIB EE","   Oneri diversi di gestione","   Oneri diversi di gestione","   Oneri diversi di gestione"]
["100669.000308.012515","CE Attività VEND CL LIB EE",100669,12515,308,"Invariata","VEND CL LIB EE","    14-bis ) oneri non ricorrenti","    14-bis ) oneri non ricorrenti","    14-bis ) oneri non ricorrenti"]
["100669.000307.000574","CE Attività VEND CL LIB EE",100669,574,307,"Invariata","VEND CL LIB EE","  ACQUISTI INTERNI","  ACQUISTI INTERNI","  ACQUISTI INTERNI"]
["100669.000574.010916","CE Attività VEND CL LIB EE",100669,10916,574,"Invariata","VEND CL LIB EE","       Acquisto interno di beni e servizi da altre attività a prezzo di mercato","       Acquisto interno di beni e servizi da altre attività a prezzo di mercato","       Acquisto interno di beni e servizi da altre attività a prezzo di mercato"]
["100669.000000.001142","CE Attività VEND CL LIB EE",100669,1142,null,"Invariata","VEND CL LIB EE","DIFFERENZA TRA VALORE E COSTI DELLA PRODUZIONE","DIFFERENZA TRA VALORE E COSTI DELLA PRODUZIONE","DIFFERENZA TRA VALORE E COSTI DELLA PRODUZIONE"]
["100669.000000.000603","CE Attività VEND CL LIB EE",100669,603,null,"Invariata","VEND CL LIB EE","   COSTI INDIRETTI","   COSTI INDIRETTI","   COSTI INDIRETTI"]
["100669.000603.000605","CE Attività VEND CL LIB EE",100669,605,603,"Invariata","VEND CL LIB EE","       Costi attribuiti dalle funzioni operative condivise","       Costi attribuiti dalle funzioni operative condivise","       Costi attribuiti dalle funzioni operative condivise"]
["100669.000605.000608","CE Attività VEND CL LIB EE",100669,608,605,"Invariata","VEND CL LIB EE","       Funzione operativa condivisa di misura tra attività di settori diversi o tra attività diverse del settore idrico","       Funzione operativa condivisa di misura tra attività di settori diversi o tra attività diverse del settore idrico","       Funzione operativa condivisa di misura tra attività di settori diversi o tra attività diverse del settore idrico"]
["100669.000605.000610","CE Attività VEND CL LIB EE",100669,610,605,"Invariata","VEND CL LIB EE","          Funzione operativa condivisa di cartografia elettronica","          Funzione operativa condivisa di cartografia elettronica","          Funzione operativa condivisa di cartografia elettronica"]
["100669.000605.010937","CE Attività VEND CL LIB EE",100669,10937,605,"Invariata","VEND CL LIB EE","       Funzione operativa condivisa commerciale, di vendita e gestione clientela del settore elettrico","       Funzione operativa condivisa commerciale, di vendita e gestione clientela del settore elettrico","       Funzione operativa condivisa commerciale, di vendita e gestione clientela del settore elettrico"]
["100669.000605.010938","CE Attività VEND CL LIB EE",100669,10938,605,"Invariata","VEND CL LIB EE","       Funzione operativa condivisa commerciale, di vendita e gestione clientela del settore gas","       Funzione operativa condivisa commerciale, di vendita e gestione clientela del settore gas","       Funzione operativa condivisa commerciale, di vendita e gestione clientela del settore gas"]
["100669.000605.010939","CE Attività VEND CL LIB EE",100669,10939,605,"Invariata","VEND CL LIB EE","       Funzione operativa condivisa commerciale, di vendita e gestione clientela comune al settore elettrico e gas","       Funzione operativa condivisa commerciale, di vendita e gestione clientela comune al settore elettrico e gas","       Funzione operativa condivisa commerciale, di vendita e gestione clientela comune al settore elettrico e gas"]
["100669.000605.010940","CE Attività VEND CL LIB EE",100669,10940,605,"Invariata","VEND CL LIB EE","       Funzione operativa condivisa di acquisto di energia elettrica","       Funzione operativa condivisa di acquisto di energia elettrica","       Funzione operativa condivisa di acquisto di energia elettrica"]
["100669.000605.010941","CE Attività VEND CL LIB EE",100669,10941,605,"Invariata","VEND CL LIB EE","       Funzione operativa condivisa di acquisto di gas","       Funzione operativa condivisa di acquisto di gas","       Funzione operativa condivisa di acquisto di gas"]
[{"$f":"CONCATENATE(TEXT(C612,\"000000\"),\".\",TEXT(E612,\"000000\"),\".\",TEXT(D612,\"000000\"))","v":"100669.000605.010942"},"CE Attività VEND CL LIB EE",100669,10942,605,"Invariata","VEND CL LIB EE","       Funzione operativa condivisa di acquisto comune di energia elettrica e di gas","       Funzione operativa condivisa di acquisto comune di energia elettrica e di gas","       Funzione operativa condivisa di acquisto comune di energia elettrica e di gas"]
["100669.000605.011512","CE Attività VEND CL LIB EE",100669,11512,605,"Invariata","VEND CL LIB EE","       Funzione operativa condivisa di verifica e controllo","       Funzione operativa condivisa di verifica e controllo","       Funzione operativa condivisa di verifica e controllo"]
["100669.000605.011517","CE Attività VEND CL LIB EE",100669,11517,605,"Invariata","VEND CL LIB EE","       Funzione operativa condivisa di telecontrollo e ricerca perdite","       Funzione operativa condivisa di telecontrollo e ricerca perdite","       Funzione operativa condivisa di telecontrollo e ricerca perdite"]
["100669.000605.011521","CE Attività VEND CL LIB EE",100669,11521,605,"Invariata","VEND CL LIB EE","       Funzione operativa condivisa di manutenzione e servizi tecnici","       Funzione operativa condivisa di manutenzione e servizi tecnici","       Funzione operativa condivisa di manutenzione e servizi tecnici"]
["100669.000603.000612","CE Attività VEND CL LIB EE",100669,612,603,"Invariata","VEND CL LIB EE","       Costi attribuiti dai servizi comuni","       Costi attribuiti dai servizi comuni","       Costi attribuiti dai servizi comuni"]
["100669.000612.002010","CE Attività VEND CL LIB EE",100669,2010,612,"Invariata","VEND CL LIB EE","          Costi attribuiti dai servizi comuni","          Costi attribuiti dai servizi comuni","          Costi attribuiti dai servizi comuni"]
["100669.000603.010957","CE Attività VEND CL LIB EE",100669,10957,603,"Invariata","VEND CL LIB EE","       Acquisto interno di beni e servizi da altre attività a costo pieno","       Acquisto interno di beni e servizi da altre attività a costo pieno","       Acquisto interno di beni e servizi da altre attività a costo pieno"]
["100669.000000.001143","CE Attività VEND CL LIB EE",100669,1143,null,"Invariata","VEND CL LIB EE","COSTI DELLA PRODUZIONE (DIRETTI + INDIRETTI)","COSTI DELLA PRODUZIONE (DIRETTI + INDIRETTI)","COSTI DELLA PRODUZIONE (DIRETTI + INDIRETTI)"]
["100669.000000.002009","CE Attività VEND CL LIB EE",100669,2009,null,"Invariata","VEND CL LIB EE","DIFFERENZA TRA VALORE E COSTI DELLA PRODUZIONE DOPO TRANSAZIONI INTERNE","DIFFERENZA TRA VALORE E COSTI DELLA PRODUZIONE DOPO TRANSAZIONI INTERNE","DIFFERENZA TRA VALORE E COSTI DELLA PRODUZIONE DOPO TRANSAZIONI INTERNE"]
["100669.000000.001144","CE Attività VEND CL LIB EE",100669,1144,null,"Invariata","VEND CL LIB EE","DIFFERENZA TRA VALORE E COSTI DELLA PRODUZIONE DOPO TRANSAZIONI INTERNE E ATTRIBUZIONE DEI VALORI RELATIVI ALLE FUNZIONI OPERATIVE CONDIVISE E AI SERVIZI COMUNI","DIFFERENZA TRA VALORE E COSTI DELLA PRODUZIONE DOPO TRANSAZIONI INTERNE E ATTRIBUZIONE DEI VALORI RELATIVI ALLE FUNZIONI OPERATIVE CONDIVISE E AI SERVIZI COMUNI","DIFFERENZA TRA VALORE E COSTI DELLA PRODUZIONE DOPO TRANSAZIONI INTERNE E ATTRIBUZIONE DEI VALORI RELATIVI ALLE FUNZIONI OPERATIVE CONDIVISE E AI SERVIZI COMUNI"]
["100839.000000.000001","CE Attività EE ESTR",100839,1,null,"Invariata","EE ESTR","  A.1) VALORE DELLA PRODUZIONE COMPRENSIVO DELLE VENDITE INTERNE","  A.1) VALORE DELLA PRODUZIONE COMPRENSIVO DELLE VENDITE INTERNE","  A.1) VALORE DELLA PRODUZIONE COMPRENSIVO DELLE VENDITE INTERNE"]
["100839.000001.000002","CE Attività EE ESTR",100839,2,1,"Invariata","EE ESTR","  A) VALORE DELLA PRODUZIONE","  A) VALORE DELLA PRODUZIONE","  A) VALORE DELLA PRODUZIONE"]
["100839.000002.000003","CE Attività EE ESTR",100839,3,2,"Invariata","EE ESTR","    1) Ricavi delle vendite e delle prestazioni","    1) Ricavi delle vendite e delle prestazioni","    1) Ricavi delle vendite e delle prestazioni"]
["100839.000003.001149","CE Attività EE ESTR",100839,1149,3,"Invariata","EE ESTR"," Ricavi dalle vendite e dalle prestazioni"," Ricavi dalle vendite e dalle prestazioni"," Ricavi dalle vendite e dalle prestazioni"]
["100839.000002.000253","CE Attività EE ESTR",100839,253,2,"Invariata","EE ESTR","    2) Variazioni delle rimanenze di prodotti in corso di lavorazione, semilavorati e finiti","    2) Variazioni delle rimanenze di prodotti in corso di lavorazione, semilavorati e finiti","    2) Variazioni delle rimanenze di prodotti in corso di lavorazione, semilavorati e finiti"]
["100839.000253.000254","CE Attività EE ESTR",100839,254,253,"Invariata","EE ESTR","       Variazioni delle rimanenze di prodotti in corso di lavorazione, semilavorati e finiti","       Variazioni delle rimanenze di prodotti in corso di lavorazione, semilavorati e finiti","       Variazioni delle rimanenze di prodotti in corso di lavorazione, semilavorati e finiti"]
["100839.000002.000255","CE Attività EE ESTR",100839,255,2,"Invariata","EE ESTR","    3) Variazioni dei lavori in corso su ordinazioni","    3) Variazioni dei lavori in corso su ordinazioni","    3) Variazioni dei lavori in corso su ordinazioni"]
["100839.000255.000256","CE Attività EE ESTR",100839,256,255,"Invariata","EE ESTR","       Variazioni dei lavori in corso su ordinazione","       Variazioni dei lavori in corso su ordinazione","       Variazioni dei lavori in corso su ordinazione"]
["100839.000002.000257","CE Attività EE ESTR",100839,257,2,"Invariata","EE ESTR","    4) Incrementi di immobilizzazioni per lavori interni ","    4) Incrementi di immobilizzazioni per lavori interni ","    4) Incrementi di immobilizzazioni per lavori interni "]
["100839.000257.002001","CE Attività EE ESTR",100839,2001,257,"Invariata","EE ESTR","  Incrementi di immobilizzazioni per lavori interni ","  Incrementi di immobilizzazioni per lavori interni ","  Incrementi di immobilizzazioni per lavori interni "]
["100839.000002.011466","CE Attività EE ESTR",100839,11466,2,"Invariata","EE ESTR","    5) Altri ricavi e proventi, con separata indicazione dei contributi in conto esercizio","    5) Altri ricavi e proventi, con separata indicazione dei contributi in conto esercizio","    5) Altri ricavi e proventi, con separata indicazione dei contributi in conto esercizio"]
["100839.011466.011457","CE Attività EE ESTR",100839,11457,11466,"Invariata","EE ESTR","   Altri ricavi e proventi","   Altri ricavi e proventi","   Altri ricavi e proventi"]
["100839.000002.012514","CE Attività EE ESTR",100839,12514,2,"Invariata","EE ESTR","    5-bis) ricavi non ricorrenti","    5-bis) ricavi non ricorrenti","    5-bis) ricavi non ricorrenti"]
["100839.000001.000302","CE Attività EE ESTR",100839,302,1,"Invariata","EE ESTR","  VENDITE INTERNE","  VENDITE INTERNE","  VENDITE INTERNE"]
["100839.000302.000304","CE Attività EE ESTR",100839,304,302,"Invariata","EE ESTR","    Vendita interna di beni e servizi ad altre attività a prezzo di mercato","    Vendita interna di beni e servizi ad altre attività a prezzo di mercato","    Vendita interna di beni e servizi ad altre attività a prezzo di mercato"]
["100839.000302.010968","CE Attività EE ESTR",100839,10968,302,"Invariata","EE ESTR","    Vendita interna di beni e servizi ad altre attività a costo pieno","    Vendita interna di beni e servizi ad altre attività a costo pieno","    Vendita interna di beni e servizi ad altre attività a costo pieno"]
["100839.000000.000307","CE Attività EE ESTR",100839,307,null,"Invariata","EE ESTR","B.1) COSTI DELLA PRODUZIONE COMPRENSIVI DEGLI ACQUISTI INTERNI","B.1) COSTI DELLA PRODUZIONE COMPRENSIVI DEGLI ACQUISTI INTERNI","B.1) COSTI DELLA PRODUZIONE COMPRENSIVI DEGLI ACQUISTI INTERNI"]
["100839.000307.000308","CE Attività EE ESTR",100839,308,307,"Invariata","EE ESTR","  B) COSTI DELLA PRODUZIONE","  B) COSTI DELLA PRODUZIONE","  B) COSTI DELLA PRODUZIONE"]
["100839.000308.000309","CE Attività EE ESTR",100839,309,308,"Invariata","EE ESTR","    6) Per materie prime, sussidiarie, di consumo e di merci (a livello di attività vanno riportati i consumi)","    6) Per materie prime, sussidiarie, di consumo e di merci (a livello di attività vanno riportati i consumi)","    6) Per materie prime, sussidiarie, di consumo e di merci (a livello di attività vanno riportati i consumi)"]
["100839.000309.002007","CE Attività EE ESTR",100839,2007,309,"Invariata","EE ESTR","Per acquisto e trasporto dell'energia","Per acquisto e trasporto dell'energia","Per acquisto e trasporto dell'energia"]
["100839.000309.002008","CE Attività EE ESTR",100839,2008,309,"Invariata","EE ESTR","Altri costi di materie prime, sussidiarie, di consumo e di merci","Altri costi di materie prime, sussidiarie, di consumo e di merci","Altri costi di materie prime, sussidiarie, di consumo e di merci"]
["100839.000308.000416","CE Attività EE ESTR",100839,416,308,{"$f":"IF(TRIM(H643)=TRIM(I643),\"Invariata\",IF(H643=\"\",\"Aggiunta\",IF(I643=\"\",\"Eliminata\",\"Modificata\")))","v":"Invariata"},"EE ESTR","    7) Per servizi","    7) Per servizi","    7) Per servizi"]
["100839.000416.002003","CE Attività EE ESTR",100839,2003,416,"Invariata","EE ESTR","     Per servizi","     Per servizi","     Per servizi"]
["100839.000308.000511","CE Attività EE ESTR",100839,511,308,"Invariata","EE ESTR","    8) Per godimento beni di terzi","    8) Per godimento beni di terzi","    8) Per godimento beni di terzi"]
["100839.000511.002004","CE Attività EE ESTR",100839,2004,511,"Invariata","EE ESTR","          Per godimento beni di terzi","          Per godimento beni di terzi","          Per godimento beni di terzi"]
["100839.000308.000532","CE Attività EE ESTR",100839,532,308,"Invariata","EE ESTR","    9) Per il personale ","    9) Per il personale ","    9) Per il personale "]
["100839.000532.002005","CE Attività EE ESTR",100839,2005,532,"Invariata","EE ESTR","    Per il personale ","    Per il personale ","    Per il personale "]
["100839.000308.000544","CE Attività EE ESTR",100839,544,308,"Invariata","EE ESTR","    10) Ammortamenti e svalutazioni","    10) Ammortamenti e svalutazioni","    10) Ammortamenti e svalutazioni"]
["100839.000544.000545","CE Attività EE ESTR",100839,545,544,"Invariata","EE ESTR","       Ammortamento delle immobilizzazioni immateriali","       Ammortamento delle immobilizzazioni immateriali","       Ammortamento delle immobilizzazioni immateriali"]
["100839.000544.000547","CE Attività EE ESTR",100839,547,544,"Invariata","EE ESTR","       Ammortamento delle immobilizzazioni materiali (ammortamento tecnicoeconomico)","       Ammortamento delle immobilizzazioni materiali (ammortamento tecnicoeconomico)","       Ammortamento delle immobilizzazioni materiali (ammortamento tecnicoeconomico)"]
["100839.000544.000548","CE Attività EE ESTR",100839,548,544,"Invariata","EE ESTR","       Ammortamento delle immobilizzazioni materiali (ammortamento finanziario)","       Ammortamento delle immobilizzazioni materiali (ammortamento finanziario)","       Ammortamento delle immobilizzazioni materiali (ammortamento finanziario)"]
["100839.000544.000549","CE Attività EE ESTR",100839,549,544,"Invariata","EE ESTR","       Altre svalutazioni delle immobilizzazioni","       Altre svalutazioni delle immobilizzazioni","       Altre svalutazioni delle immobilizzazioni"]
["100839.000544.000550","CE Attività EE ESTR",100839,550,544,"Invariata","EE ESTR","       Svalutazione dei crediti compresi nell'attivo circolante e delle disponibilità","       Svalutazione dei crediti compresi nell'attivo circolante e delle disponibilità","       Svalutazione dei crediti compresi nell'attivo circolante e delle disponibilità"]
["100839.000308.000554","CE Attività EE ESTR",100839,554,308,"Invariata","EE ESTR","    12) Accantonamenti per rischi","    12) Accantonamenti per rischi","    12) Accantonamenti per rischi"]
["100839.000554.001135","CE Attività EE ESTR",100839,1135,554,"Invariata","EE ESTR","          - accantonamenti per rischi ","          - accantonamenti per rischi ","          - accantonamenti per rischi "]
["100839.000308.000558","CE Attività EE ESTR",100839,558,308,"Invariata","EE ESTR","    13) Altri accantonamenti","    13) Altri accantonamenti","    13) Altri accantonamenti"]
["100839.000558.000559","CE Attività EE ESTR",100839,559,558,"Invariata","EE ESTR","       Altri accantonamenti","       Altri accantonamenti","       Altri accantonamenti"]
["100839.000308.000560","CE Attività EE ESTR",100839,560,308,"Invariata","EE ESTR","    14) Oneri diversi di gestione","    14) Oneri diversi di gestione","    14) Oneri diversi di gestione"]
["100839.000560.002006","CE Attività EE ESTR",100839,2006,560,"Invariata","EE ESTR","   Oneri diversi di gestione","   Oneri diversi di gestione","   Oneri diversi di gestione"]
["100839.000308.012515","CE Attività EE ESTR",100839,12515,308,"Invariata","EE ESTR","    14-bis ) oneri non ricorrenti","    14-bis ) oneri non ricorrenti","    14-bis ) oneri non ricorrenti"]
["100839.000307.000574","CE Attività EE ESTR",100839,574,307,"Invariata","EE ESTR","  ACQUISTI INTERNI","  ACQUISTI INTERNI","  ACQUISTI INTERNI"]
["100839.000574.010916","CE Attività EE ESTR",100839,10916,574,"Invariata","EE ESTR","       Acquisto interno di beni e servizi da altre attività a prezzo di mercato","       Acquisto interno di beni e servizi da altre attività a prezzo di mercato","       Acquisto interno di beni e servizi da altre attività a prezzo di mercato"]
["100839.000000.001142","CE Attività EE ESTR",100839,1142,null,"Invariata","EE ESTR","DIFFERENZA TRA VALORE E COSTI DELLA PRODUZIONE","DIFFERENZA TRA VALORE E COSTI DELLA PRODUZIONE","DIFFERENZA TRA VALORE E COSTI DELLA PRODUZIONE"]
["100839.000000.000603","CE Attività EE ESTR",100839,603,null,"Invariata","EE ESTR","   COSTI INDIRETTI","   COSTI INDIRETTI","   COSTI INDIRETTI"]
["100839.000603.000605","CE Attività EE ESTR",100839,605,603,"Invariata","EE ESTR","       Costi attribuiti dalle funzioni operative condivise","       Costi attribuiti dalle funzioni operative condivise","       Costi attribuiti dalle funzioni operative condivise"]
["100839.000605.000608","CE Attività EE ESTR",100839,608,605,"Invariata","EE ESTR","       Funzione operativa condivisa di misura tra attività di settori diversi o tra attività diverse del settore idrico","       Funzione operativa condivisa di misura tra attività di settori diversi o tra attività diverse del settore idrico","       Funzione operativa condivisa di misura tra attività di settori diversi o tra attività diverse del settore idrico"]
["100839.000605.000610","CE Attività EE ESTR",100839,610,605,"Invariata","EE ESTR","          Funzione operativa condivisa di cartografia elettronica","          Funzione operativa condivisa di cartografia elettronica","          Funzione operativa condivisa di cartografia elettronica"]
["100839.000605.010937","CE Attività EE ESTR",100839,10937,605,"Invariata","EE ESTR","       Funzione operativa condivisa commerciale, di vendita e gestione clientela del settore elettrico","       Funzione operativa condivisa commerciale, di vendita e gestione clientela del settore elettrico","       Funzione operativa condivisa commerciale, di vendita e gestione clientela del settore elettrico"]
["100839.000605.010938","CE Attività EE ESTR",100839,10938,605,"Invariata","EE ESTR","       Funzione operativa condivisa commerciale, di vendita e gestione clientela del settore gas","       Funzione operativa condivisa commerciale, di vendita e gestione clientela del settore gas","       Funzione operativa condivisa commerciale, di vendita e gestione clientela del settore gas"]
["100839.000605.010939","CE Attività EE ESTR",100839,10939,605,"Invariata","EE ESTR","       Funzione operativa condivisa commerciale, di vendita e gestione clientela comune al settore elettrico e gas","       Funzione operativa condivisa commerciale, di vendita e gestione clientela comune al settore elettrico e gas","       Funzione operativa condivisa commerciale, di vendita e gestione clientela comune al settore elettrico e gas"]
["100839.000605.010940","CE Attività EE ESTR",100839,10940,605,"Invariata","EE ESTR","       Funzione operativa condivisa di acquisto di energia elettrica","       Funzione operativa condivisa di acquisto di energia elettrica","       Funzione operativa condivisa di acquisto di energia elettrica"]
["100839.000605.010941","CE Attività EE ESTR",100839,10941,605,"Invariata","EE ESTR","       Funzione operativa condivisa di acquisto di gas","       Funzione operativa condivisa di acquisto di gas","       Funzione operativa condivisa di acquisto di gas"]
["100839.000605.010942","CE Attività EE ESTR",100839,10942,605,"Invariata","EE ESTR","       Funzione operativa condivisa di acquisto comune di energia elettrica e di gas","       Funzione operativa condivisa di acquisto comune di energia elettrica e di gas","       Funzione operativa condivisa di acquisto comune di energia elettrica e di gas"]
["100839.000605.011512","CE Attività EE ESTR",100839,11512,605,"Invariata","EE ESTR","       Funzione operativa condivisa di verifica e controllo","       Funzione operativa condivisa di verifica e controllo","       Funzione operativa condivisa di verifica e controllo"]
[{"$f":"CONCATENATE(TEXT(C676,\"000000\"),\".\",TEXT(E676,\"000000\"),\".\",TEXT(D676,\"000000\"))","v":"100839.000605.011517"},"CE Attività EE ESTR",100839,11517,605,"Invariata","EE ESTR","       Funzione operativa condivisa di telecontrollo e ricerca perdite","       Funzione operativa condivisa di telecontrollo e ricerca perdite","       Funzione operativa condivisa di telecontrollo e ricerca perdite"]
["100839.000605.011521","CE Attività EE ESTR",100839,11521,605,"Invariata","EE ESTR","       Funzione operativa condivisa di manutenzione e servizi tecnici","       Funzione operativa condivisa di manutenzione e servizi tecnici","       Funzione operativa condivisa di manutenzione e servizi tecnici"]
["100839.000603.000612","CE Attività EE ESTR",100839,612,603,"Invariata","EE ESTR","       Costi attribuiti dai servizi comuni","       Costi attribuiti dai servizi comuni","       Costi attribuiti dai servizi comuni"]
["100839.000612.002010","CE Attività EE ESTR",100839,2010,612,"Invariata","EE ESTR","          Costi attribuiti dai servizi comuni","          Costi attribuiti dai servizi comuni","          Costi attribuiti dai servizi comuni"]
["100839.000603.010957","CE Attività EE ESTR",100839,10957,603,"Invariata","EE ESTR","       Acquisto interno di beni e servizi da altre attività a costo pieno","       Acquisto interno di beni e servizi da altre attività a costo pieno","       Acquisto interno di beni e servizi da altre attività a costo pieno"]
["100839.000000.001143","CE Attività EE ESTR",100839,1143,null,"Invariata","EE ESTR","COSTI DELLA PRODUZIONE (DIRETTI + INDIRETTI)","COSTI DELLA PRODUZIONE (DIRETTI + INDIRETTI)","COSTI DELLA PRODUZIONE (DIRETTI + INDIRETTI)"]
["100839.000000.002009","CE Attività EE ESTR",100839,2009,null,"Invariata","EE ESTR","DIFFERENZA TRA VALORE E COSTI DELLA PRODUZIONE DOPO TRANSAZIONI INTERNE","DIFFERENZA TRA VALORE E COSTI DELLA PRODUZIONE DOPO TRANSAZIONI INTERNE","DIFFERENZA TRA VALORE E COSTI DELLA PRODUZIONE DOPO TRANSAZIONI INTERNE"]
["100839.000000.001144","CE Attività EE ESTR",100839,1144,null,"Invariata","EE ESTR","DIFFERENZA TRA VALORE E COSTI DELLA PRODUZIONE DOPO TRANSAZIONI INTERNE E ATTRIBUZIONE DEI VALORI RELATIVI ALLE FUNZIONI OPERATIVE CONDIVISE E AI SERVIZI COMUNI","DIFFERENZA TRA VALORE E COSTI DELLA PRODUZIONE DOPO TRANSAZIONI INTERNE E ATTRIBUZIONE DEI VALORI RELATIVI ALLE FUNZIONI OPERATIVE CONDIVISE E AI SERVIZI COMUNI","DIFFERENZA TRA VALORE E COSTI DELLA PRODUZIONE DOPO TRANSAZIONI INTERNE E ATTRIBUZIONE DEI VALORI RELATIVI ALLE FUNZIONI OPERATIVE CONDIVISE E AI SERVIZI COMUNI"]
["100833.000000.000001","CE Attività COL GAS",100833,1,null,"Invariata","COL GAS","  A.1) VALORE DELLA PRODUZIONE COMPRENSIVO DELLE VENDITE INTERNE","  A.1) VALORE DELLA PRODUZIONE COMPRENSIVO DELLE VENDITE INTERNE","  A.1) VALORE DELLA PRODUZIONE COMPRENSIVO DELLE VENDITE INTERNE"]
["100833.000001.000002","CE Attività COL GAS",100833,2,1,"Invariata","COL GAS","  A) VALORE DELLA PRODUZIONE","  A) VALORE DELLA PRODUZIONE","  A) VALORE DELLA PRODUZIONE"]
["100833.000002.000003","CE Attività COL GAS",100833,3,2,"Invariata","COL GAS","    1) Ricavi delle vendite e delle prestazioni","    1) Ricavi delle vendite e delle prestazioni","    1) Ricavi delle vendite e delle prestazioni"]
["100833.000003.001149","CE Attività COL GAS",100833,1149,3,"Invariata","COL GAS"," Ricavi dalle vendite e dalle prestazioni"," Ricavi dalle vendite e dalle prestazioni"," Ricavi dalle vendite e dalle prestazioni"]
["100833.000002.000253","CE Attività COL GAS",100833,253,2,"Invariata","COL GAS","    2) Variazioni delle rimanenze di prodotti in corso di lavorazione, semilavorati e finiti","    2) Variazioni delle rimanenze di prodotti in corso di lavorazione, semilavorati e finiti","    2) Variazioni delle rimanenze di prodotti in corso di lavorazione, semilavorati e finiti"]
["100833.000253.000254","CE Attività COL GAS",100833,254,253,"Invariata","COL GAS","       Variazioni delle rimanenze di prodotti in corso di lavorazione, semilavorati e finiti","       Variazioni delle rimanenze di prodotti in corso di lavorazione, semilavorati e finiti","       Variazioni delle rimanenze di prodotti in corso di lavorazione, semilavorati e finiti"]
["100833.000002.000255","CE Attività COL GAS",100833,255,2,"Invariata","COL GAS","    3) Variazioni dei lavori in corso su ordinazioni","    3) Variazioni dei lavori in corso su ordinazioni","    3) Variazioni dei lavori in corso su ordinazioni"]
["100833.000255.000256","CE Attività COL GAS",100833,256,255,"Invariata","COL GAS","       Variazioni dei lavori in corso su ordinazione","       Variazioni dei lavori in corso su ordinazione","       Variazioni dei lavori in corso su ordinazione"]
["100833.000002.000257","CE Attività COL GAS",100833,257,2,"Invariata","COL GAS","    4) Incrementi di immobilizzazioni per lavori interni ","    4) Incrementi di immobilizzazioni per lavori interni ","    4) Incrementi di immobilizzazioni per lavori interni "]
["100833.000257.002001","CE Attività COL GAS",100833,2001,257,"Invariata","COL GAS","  Incrementi di immobilizzazioni per lavori interni ","  Incrementi di immobilizzazioni per lavori interni ","  Incrementi di immobilizzazioni per lavori interni "]
["100833.000002.011466","CE Attività COL GAS",100833,11466,2,"Invariata","COL GAS","    5) Altri ricavi e proventi, con separata indicazione dei contributi in conto esercizio","    5) Altri ricavi e proventi, con separata indicazione dei contributi in conto esercizio","    5) Altri ricavi e proventi, con separata indicazione dei contributi in conto esercizio"]
["100833.011466.011457","CE Attività COL GAS",100833,11457,11466,"Invariata","COL GAS","   Altri ricavi e proventi","   Altri ricavi e proventi","   Altri ricavi e proventi"]
["100833.000002.012514","CE Attività COL GAS",100833,12514,2,"Invariata","COL GAS","    5-bis) ricavi non ricorrenti","    5-bis) ricavi non ricorrenti","    5-bis) ricavi non ricorrenti"]
["100833.000001.000302","CE Attività COL GAS",100833,302,1,"Invariata","COL GAS","  VENDITE INTERNE","  VENDITE INTERNE","  VENDITE INTERNE"]
["100833.000302.000304","CE Attività COL GAS",100833,304,302,"Invariata","COL GAS","    Vendita interna di beni e servizi ad altre attività a prezzo di mercato","    Vendita interna di beni e servizi ad altre attività a prezzo di mercato","    Vendita interna di beni e servizi ad altre attività a prezzo di mercato"]
["100833.000302.010968","CE Attività COL GAS",100833,10968,302,"Invariata","COL GAS","    Vendita interna di beni e servizi ad altre attività a costo pieno","    Vendita interna di beni e servizi ad altre attività a costo pieno","    Vendita interna di beni e servizi ad altre attività a costo pieno"]
["100833.000000.000307","CE Attività COL GAS",100833,307,null,"Invariata","COL GAS","B.1) COSTI DELLA PRODUZIONE COMPRENSIVI DEGLI ACQUISTI INTERNI","B.1) COSTI DELLA PRODUZIONE COMPRENSIVI DEGLI ACQUISTI INTERNI","B.1) COSTI DELLA PRODUZIONE COMPRENSIVI DEGLI ACQUISTI INTERNI"]
["100833.000307.000308","CE Attività COL GAS",100833,308,307,"Invariata","COL GAS","  B) COSTI DELLA PRODUZIONE","  B) COSTI DELLA PRODUZIONE","  B) COSTI DELLA PRODUZIONE"]
["100833.000308.000309","CE Attività COL GAS",100833,309,308,"Invariata","COL GAS","    6) Per materie prime, sussidiarie, di consumo e di merci (a livello di attività vanno riportati i consumi)","    6) Per materie prime, sussidiarie, di consumo e di merci (a livello di attività vanno riportati i consumi)","    6) Per materie prime, sussidiarie, di consumo e di merci (a livello di attività vanno riportati i consumi)"]
["100833.000309.002007","CE Attività COL GAS",100833,2007,309,"Invariata","COL GAS","Per acquisto e trasporto dell'energia","Per acquisto e trasporto dell'energia","Per acquisto e trasporto dell'energia"]
["100833.000309.002008","CE Attività COL GAS",100833,2008,309,"Invariata","COL GAS","Altri costi di materie prime, sussidiarie, di consumo e di merci","Altri costi di materie prime, sussidiarie, di consumo e di merci","Altri costi di materie prime, sussidiarie, di consumo e di merci"]
["100833.000308.000416","CE Attività COL GAS",100833,416,308,"Invariata","COL GAS","    7) Per servizi","    7) Per servizi","    7) Per servizi"]
["100833.000416.002003","CE Attività COL GAS",100833,2003,416,"Invariata","COL GAS","     Per servizi","     Per servizi","     Per servizi"]
["100833.000308.000511","CE Attività COL GAS",100833,511,308,{"$f":"IF(TRIM(H707)=TRIM(I707),\"Invariata\",IF(H707=\"\",\"Aggiunta\",IF(I707=\"\",\"Eliminata\",\"Modificata\")))","v":"Invariata"},"COL GAS","    8) Per godimento beni di terzi","    8) Per godimento beni di terzi","    8) Per godimento beni di terzi"]
["100833.000511.002004","CE Attività COL GAS",100833,2004,511,"Invariata","COL GAS","          Per godimento beni di terzi","          Per godimento beni di terzi","          Per godimento beni di terzi"]
["100833.000308.000532","CE Attività COL GAS",100833,532,308,"Invariata","COL GAS","    9) Per il personale ","    9) Per il personale ","    9) Per il personale "]
["100833.000532.002005","CE Attività COL GAS",100833,2005,532,"Invariata","COL GAS","    Per il personale ","    Per il personale ","    Per il personale "]
["100833.000308.000544","CE Attività COL GAS",100833,544,308,"Invariata","COL GAS","    10) Ammortamenti e svalutazioni","    10) Ammortamenti e svalutazioni","    10) Ammortamenti e svalutazioni"]
["100833.000544.000545","CE Attività COL GAS",100833,545,544,"Invariata","COL GAS","       Ammortamento delle immobilizzazioni immateriali","       Ammortamento delle immobilizzazioni immateriali","       Ammortamento delle immobilizzazioni immateriali"]
["100833.000544.000547","CE Attività COL GAS",100833,547,544,"Invariata","COL GAS","       Ammortamento delle immobilizzazioni materiali (ammortamento tecnicoeconomico)","       Ammortamento delle immobilizzazioni materiali (ammortamento tecnicoeconomico)","       Ammortamento delle immobilizzazioni materiali (ammortamento tecnicoeconomico)"]
["100833.000544.000548","CE Attività COL GAS",100833,548,544,"Invariata","COL GAS","       Ammortamento delle immobilizzazioni materiali (ammortamento finanziario)","       Ammortamento delle immobilizzazioni materiali (ammortamento finanziario)","       Ammortamento delle immobilizzazioni materiali (ammortamento finanziario)"]
["100833.000544.000549","CE Attività COL GAS",100833,549,544,"Invariata","COL GAS","       Altre svalutazioni delle immobilizzazioni","       Altre svalutazioni delle immobilizzazioni","       Altre svalutazioni delle immobilizzazioni"]
["100833.000544.000550","CE Attività COL GAS",100833,550,544,"Invariata","COL GAS","       Svalutazione dei crediti compresi nell'attivo circolante e delle disponibilità","       Svalutazione dei crediti compresi nell'attivo circolante e delle disponibilità","       Svalutazione dei crediti compresi nell'attivo circolante e delle disponibilità"]
["100833.000308.000554","CE Attività COL GAS",100833,554,308,"Invariata","COL GAS","    12) Accantonamenti per rischi","    12) Accantonamenti per rischi","    12) Accantonamenti per rischi"]
["100833.000554.001135","CE Attività COL GAS",100833,1135,554,"Invariata","COL GAS","          - accantonamenti per rischi ","          - accantonamenti per rischi ","          - accantonamenti per rischi "]
["100833.000308.000558","CE Attività COL GAS",100833,558,308,"Invariata","COL GAS","    13) Altri accantonamenti","    13) Altri accantonamenti","    13) Altri accantonamenti"]
["100833.000558.000559","CE Attività COL GAS",100833,559,558,"Invariata","COL GAS","       Altri accantonamenti","       Altri accantonamenti","       Altri accantonamenti"]
["100833.000308.000560","CE Attività COL GAS",100833,560,308,"Invariata","COL GAS","    14) Oneri diversi di gestione","    14) Oneri diversi di gestione","    14) Oneri diversi di gestione"]
["100833.000560.002006","CE Attività COL GAS",100833,2006,560,"Invariata","COL GAS","   Oneri diversi di gestione","   Oneri diversi di gestione","   Oneri diversi di gestione"]
["100833.000308.012515","CE Attività COL GAS",100833,12515,308,"Invariata","COL GAS","    14-bis ) oneri non ricorrenti","    14-bis ) oneri non ricorrenti","    14-bis ) oneri non ricorrenti"]
["100833.000307.000574","CE Attività COL GAS",100833,574,307,"Invariata","COL GAS","  ACQUISTI INTERNI","  ACQUISTI INTERNI","  ACQUISTI INTERNI"]
["100833.000574.010916","CE Attività COL GAS",100833,10916,574,"Invariata","COL GAS","       Acquisto interno di beni e servizi da altre attività a prezzo di mercato","       Acquisto interno di beni e servizi da altre attività a prezzo di mercato","       Acquisto interno di beni e servizi da altre attività a prezzo di mercato"]
["100833.000000.001142","CE Attività COL GAS",100833,1142,null,"Invariata","COL GAS","DIFFERENZA TRA VALORE E COSTI DELLA PRODUZIONE","DIFFERENZA TRA VALORE E COSTI DELLA PRODUZIONE","DIFFERENZA TRA VALORE E COSTI DELLA PRODUZIONE"]
["100833.000000.000603","CE Attività COL GAS",100833,603,null,"Invariata","COL GAS","   COSTI INDIRETTI","   COSTI INDIRETTI","   COSTI INDIRETTI"]
["100833.000603.000605","CE Attività COL GAS",100833,605,603,"Invariata","COL GAS","       Costi attribuiti dalle funzioni operative condivise","       Costi attribuiti dalle funzioni operative condivise","       Costi attribuiti dalle funzioni operative condivise"]
["100833.000605.000608","CE Attività COL GAS",100833,608,605,"Invariata","COL GAS","       Funzione operativa condivisa di misura tra attività di settori diversi o tra attività diverse del settore idrico","       Funzione operativa condivisa di misura tra attività di settori diversi o tra attività diverse del settore idrico","       Funzione operativa condivisa di misura tra attività di settori diversi o tra attività diverse del settore idrico"]
["100833.000605.000610","CE Attività COL GAS",100833,610,605,"Invariata","COL GAS","          Funzione operativa condivisa di cartografia elettronica","          Funzione operativa condivisa di cartografia elettronica","          Funzione operativa condivisa di cartografia elettronica"]
["100833.000605.010937","CE Attività COL GAS",100833,10937,605,"Invariata","COL GAS","       Funzione operativa condivisa commerciale, di vendita e gestione clientela del settore elettrico","       Funzione operativa condivisa commerciale, di vendita e gestione clientela del settore elettrico","       Funzione operativa condivisa commerciale, di vendita e gestione clientela del settore elettrico"]
["100833.000605.010938","CE Attività COL GAS",100833,10938,605,"Invariata","COL GAS","       Funzione operativa condivisa commerciale, di vendita e gestione clientela del settore gas","       Funzione operativa condivisa commerciale, di vendita e gestione clientela del settore gas","       Funzione operativa condivisa commerciale, di vendita e gestione clientela del settore gas"]
["100833.000605.010939","CE Attività COL GAS",100833,10939,605,"Invariata","COL GAS","       Funzione operativa condivisa commerciale, di vendita e gestione clientela comune al settore elettrico e gas","       Funzione operativa condivisa commerciale, di vendita e gestione clientela comune al settore elettrico e gas","       Funzione operativa condivisa commerciale, di vendita e gestione clientela comune al settore elettrico e gas"]
["100833.000605.010940","CE Attività COL GAS",100833,10940,605,"Invariata","COL GAS","       Funzione operativa condivisa di acquisto di energia elettrica","       Funzione operativa condivisa di acquisto di energia elettrica","       Funzione operativa condivisa di acquisto di energia elettrica"]
["100833.000605.010941","CE Attività COL GAS",100833,10941,605,"Invariata","COL GAS","       Funzione operativa condivisa di acquisto di gas","       Funzione operativa condivisa di acquisto di gas","       Funzione operativa condivisa di acquisto di gas"]
["100833.000605.010942","CE Attività COL GAS",100833,10942,605,"Invariata","COL GAS","       Funzione operativa condivisa di acquisto comune di energia elettrica e di gas","       Funzione operativa condivisa di acquisto comune di energia elettrica e di gas","       Funzione operativa condivisa di acquisto comune di energia elettrica e di gas"]
["100833.000605.011512","CE Attività COL GAS",100833,11512,605,"Invariata","COL GAS","       Funzione operativa condivisa di verifica e controllo","       Funzione operativa condivisa di verifica e controllo","       Funzione operativa condivisa di verifica e controllo"]
["100833.000605.011517","CE Attività COL GAS",100833,11517,605,"Invariata","COL GAS","       Funzione operativa condivisa di telecontrollo e ricerca perdite","       Funzione operativa condivisa di telecontrollo e ricerca perdite","       Funzione operativa condivisa di telecontrollo e ricerca perdite"]
["100833.000605.011521","CE Attività COL GAS",100833,11521,605,"Invariata","COL GAS","       Funzione operativa condivisa di manutenzione e servizi tecnici","       Funzione operativa condivisa di manutenzione e servizi tecnici","       Funzione operativa condivisa di manutenzione e servizi tecnici"]
[{"$f":"CONCATENATE(TEXT(C740,\"000000\"),\".\",TEXT(E740,\"000000\"),\".\",TEXT(D740,\"000000\"))","v":"100833.000603.000612"},"CE Attività COL GAS",100833,612,603,"Invariata","COL GAS","       Costi attribuiti dai servizi comuni","       Costi attribuiti dai servizi comuni","       Costi attribuiti dai servizi comuni"]
["100833.000612.002010","CE Attività COL GAS",100833,2010,612,"Invariata","COL GAS","          Costi attribuiti dai servizi comuni","          Costi attribuiti dai servizi comuni","          Costi attribuiti dai servizi comuni"]
["100833.000603.010957","CE Attività COL GAS",100833,10957,603,"Invariata","COL GAS","       Acquisto interno di beni e servizi da altre attività a costo pieno","       Acquisto interno di beni e servizi da altre attività a costo pieno","       Acquisto interno di beni e servizi da altre attività a costo pieno"]
["100833.000000.001143","CE Attività COL GAS",100833,1143,null,"Invariata","COL GAS","COSTI DELLA PRODUZIONE (DIRETTI + INDIRETTI)","COSTI DELLA PRODUZIONE (DIRETTI + INDIRETTI)","COSTI DELLA PRODUZIONE (DIRETTI + INDIRETTI)"]
["100833.000000.002009","CE Attività COL GAS",100833,2009,null,"Invariata","COL GAS","DIFFERENZA TRA VALORE E COSTI DELLA PRODUZIONE DOPO TRANSAZIONI INTERNE","DIFFERENZA TRA VALORE E COSTI DELLA PRODUZIONE DOPO TRANSAZIONI INTERNE","DIFFERENZA TRA VALORE E COSTI DELLA PRODUZIONE DOPO TRANSAZIONI INTERNE"]
["100833.000000.001144","CE Attività COL GAS",100833,1144,null,"Invariata","COL GAS","DIFFERENZA TRA VALORE E COSTI DELLA PRODUZIONE DOPO TRANSAZIONI INTERNE E ATTRIBUZIONE DEI VALORI RELATIVI ALLE FUNZIONI OPERATIVE CONDIVISE E AI SERVIZI COMUNI","DIFFERENZA TRA VALORE E COSTI DELLA PRODUZIONE DOPO TRANSAZIONI INTERNE E ATTRIBUZIONE DEI VALORI RELATIVI ALLE FUNZIONI OPERATIVE CONDIVISE E AI SERVIZI COMUNI","DIFFERENZA TRA VALORE E COSTI DELLA PRODUZIONE DOPO TRANSAZIONI INTERNE E ATTRIBUZIONE DEI VALORI RELATIVI ALLE FUNZIONI OPERATIVE CONDIVISE E AI SERVIZI COMUNI"]
["000289.000000.000001","CE Attività DIST GAS",289,1,null,"Invariata","DIST GAS","  A.1) VALORE DELLA PRODUZIONE COMPRENSIVO DELLE VENDITE INTERNE","  A.1) VALORE DELLA PRODUZIONE COMPRENSIVO DELLE VENDITE INTERNE","  A.1) VALORE DELLA PRODUZIONE COMPRENSIVO DELLE VENDITE INTERNE"]
["000289.000001.000002","CE Attività DIST GAS",289,2,1,"Invariata","DIST GAS","  A) VALORE DELLA PRODUZIONE","  A) VALORE DELLA PRODUZIONE","  A) VALORE DELLA PRODUZIONE"]
["000289.000002.000003","CE Attività DIST GAS",289,3,2,"Invariata","DIST GAS","    1) Ricavi delle vendite e delle prestazioni","    1) Ricavi delle vendite e delle prestazioni","    1) Ricavi delle vendite e delle prestazioni"]
["000289.000003.001149","CE Attività DIST GAS",289,1149,3,"Invariata","DIST GAS"," Ricavi dalle vendite e dalle prestazioni"," Ricavi dalle vendite e dalle prestazioni"," Ricavi dalle vendite e dalle prestazioni"]
["000289.000002.000253","CE Attività DIST GAS",289,253,2,"Invariata","DIST GAS","    2) Variazioni delle rimanenze di prodotti in corso di lavorazione, semilavorati e finiti","    2) Variazioni delle rimanenze di prodotti in corso di lavorazione, semilavorati e finiti","    2) Variazioni delle rimanenze di prodotti in corso di lavorazione, semilavorati e finiti"]
["000289.000253.000254","CE Attività DIST GAS",289,254,253,"Invariata","DIST GAS","       Variazioni delle rimanenze di prodotti in corso di lavorazione, semilavorati e finiti","       Variazioni delle rimanenze di prodotti in corso di lavorazione, semilavorati e finiti","       Variazioni delle rimanenze di prodotti in corso di lavorazione, semilavorati e finiti"]
["000289.000002.000255","CE Attività DIST GAS",289,255,2,"Invariata","DIST GAS","    3) Variazioni dei lavori in corso su ordinazioni","    3) Variazioni dei lavori in corso su ordinazioni","    3) Variazioni dei lavori in corso su ordinazioni"]
["000289.000255.000256","CE Attività DIST GAS",289,256,255,"Invariata","DIST GAS","       Variazioni dei lavori in corso su ordinazione","       Variazioni dei lavori in corso su ordinazione","       Variazioni dei lavori in corso su ordinazione"]
["000289.000002.000257","CE Attività DIST GAS",289,257,2,"Invariata","DIST GAS","    4) Incrementi di immobilizzazioni per lavori interni ","    4) Incrementi di immobilizzazioni per lavori interni ","    4) Incrementi di immobilizzazioni per lavori interni "]
["000289.000257.002001","CE Attività DIST GAS",289,2001,257,"Invariata","DIST GAS","  Incrementi di immobilizzazioni per lavori interni ","  Incrementi di immobilizzazioni per lavori interni ","  Incrementi di immobilizzazioni per lavori interni "]
["000289.000002.011466","CE Attività DIST GAS",289,11466,2,"Invariata","DIST GAS","    5) Altri ricavi e proventi, con separata indicazione dei contributi in conto esercizio","    5) Altri ricavi e proventi, con separata indicazione dei contributi in conto esercizio","    5) Altri ricavi e proventi, con separata indicazione dei contributi in conto esercizio"]
["000289.011466.011457","CE Attività DIST GAS",289,11457,11466,"Invariata","DIST GAS","   Altri ricavi e proventi","   Altri ricavi e proventi","   Altri ricavi e proventi"]
["000289.000002.012514","CE Attività DIST GAS",289,12514,2,"Invariata","DIST GAS","    5-bis) ricavi non ricorrenti","    5-bis) ricavi non ricorrenti","    5-bis) ricavi non ricorrenti"]
["000289.000001.000302","CE Attività DIST GAS",289,302,1,"Invariata","DIST GAS","  VENDITE INTERNE","  VENDITE INTERNE","  VENDITE INTERNE"]
["000289.000302.000304","CE Attività DIST GAS",289,304,302,"Invariata","DIST GAS","    Vendita interna di beni e servizi ad altre attività a prezzo di mercato","    Vendita interna di beni e servizi ad altre attività a prezzo di mercato","    Vendita interna di beni e servizi ad altre attività a prezzo di mercato"]
["000289.000302.010968","CE Attività DIST GAS",289,10968,302,"Invariata","DIST GAS","    Vendita interna di beni e servizi ad altre attività a costo pieno","    Vendita interna di beni e servizi ad altre attività a costo pieno","    Vendita interna di beni e servizi ad altre attività a costo pieno"]
["000289.000000.000307","CE Attività DIST GAS",289,307,null,"Invariata","DIST GAS","B.1) COSTI DELLA PRODUZIONE COMPRENSIVI DEGLI ACQUISTI INTERNI","B.1) COSTI DELLA PRODUZIONE COMPRENSIVI DEGLI ACQUISTI INTERNI","B.1) COSTI DELLA PRODUZIONE COMPRENSIVI DEGLI ACQUISTI INTERNI"]
["000289.000307.000308","CE Attività DIST GAS",289,308,307,"Invariata","DIST GAS","  B) COSTI DELLA PRODUZIONE","  B) COSTI DELLA PRODUZIONE","  B) COSTI DELLA PRODUZIONE"]
["000289.000308.000309","CE Attività DIST GAS",289,309,308,"Invariata","DIST GAS","    6) Per materie prime, sussidiarie, di consumo e di merci (a livello di attività vanno riportati i consumi)","    6) Per materie prime, sussidiarie, di consumo e di merci (a livello di attività vanno riportati i consumi)","    6) Per materie prime, sussidiarie, di consumo e di merci (a livello di attività vanno riportati i consumi)"]
["000289.000309.002007","CE Attività DIST GAS",289,2007,309,"Invariata","DIST GAS","Per acquisto e trasporto dell'energia","Per acquisto e trasporto dell'energia","Per acquisto e trasporto dell'energia"]
["000289.000309.002008","CE Attività DIST GAS",289,2008,309,"Invariata","DIST GAS","Altri costi di materie prime, sussidiarie, di consumo e di merci","Altri costi di materie prime, sussidiarie, di consumo e di merci","Altri costi di materie prime, sussidiarie, di consumo e di merci"]
["000289.000308.000416","CE Attività DIST GAS",289,416,308,"Invariata","DIST GAS","    7) Per servizi","    7) Per servizi","    7) Per servizi"]
["000289.000416.002003","CE Attività DIST GAS",289,2003,416,"Invariata","DIST GAS","     Per servizi","     Per servizi","     Per servizi"]
["000289.000308.000511","CE Attività DIST GAS",289,511,308,"Invariata","DIST GAS","    8) Per godimento beni di terzi","    8) Per godimento beni di terzi","    8) Per godimento beni di terzi"]
["000289.000511.002004","CE Attività DIST GAS",289,2004,511,"Invariata","DIST GAS","          Per godimento beni di terzi","          Per godimento beni di terzi","          Per godimento beni di terzi"]
["000289.000308.000532","CE Attività DIST GAS",289,532,308,{"$f":"IF(TRIM(H771)=TRIM(I771),\"Invariata\",IF(H771=\"\",\"Aggiunta\",IF(I771=\"\",\"Eliminata\",\"Modificata\")))","v":"Invariata"},"DIST GAS","    9) Per il personale ","    9) Per il personale ","    9) Per il personale "]
["000289.000532.002005","CE Attività DIST GAS",289,2005,532,"Invariata","DIST GAS","    Per il personale ","    Per il personale ","    Per il personale "]
["000289.000308.000544","CE Attività DIST GAS",289,544,308,"Invariata","DIST GAS","    10) Ammortamenti e svalutazioni","    10) Ammortamenti e svalutazioni","    10) Ammortamenti e svalutazioni"]
["000289.000544.000545","CE Attività DIST GAS",289,545,544,"Invariata","DIST GAS","       Ammortamento delle immobilizzazioni immateriali","       Ammortamento delle immobilizzazioni immateriali","       Ammortamento delle immobilizzazioni immateriali"]
["000289.000544.000547","CE Attività DIST GAS",289,547,544,"Invariata","DIST GAS","       Ammortamento delle immobilizzazioni materiali (ammortamento tecnicoeconomico)","       Ammortamento delle immobilizzazioni materiali (ammortamento tecnicoeconomico)","       Ammortamento delle immobilizzazioni materiali (ammortamento tecnicoeconomico)"]
["000289.000544.000548","CE Attività DIST GAS",289,548,544,"Invariata","DIST GAS","       Ammortamento delle immobilizzazioni materiali (ammortamento finanziario)","       Ammortamento delle immobilizzazioni materiali (ammortamento finanziario)","       Ammortamento delle immobilizzazioni materiali (ammortamento finanziario)"]
["000289.000544.000549","CE Attività DIST GAS",289,549,544,"Invariata","DIST GAS","       Altre svalutazioni delle immobilizzazioni","       Altre svalutazioni delle immobilizzazioni","       Altre svalutazioni delle immobilizzazioni"]
["000289.000544.000550","CE Attività DIST GAS",289,550,544,"Invariata","DIST GAS","       Svalutazione dei crediti compresi nell'attivo circolante e delle disponibilità","       Svalutazione dei crediti compresi nell'attivo circolante e delle disponibilità","       Svalutazione dei crediti compresi nell'attivo circolante e delle disponibilità"]
["000289.000308.000554","CE Attività DIST GAS",289,554,308,"Invariata","DIST GAS","    12) Accantonamenti per rischi","    12) Accantonamenti per rischi","    12) Accantonamenti per rischi"]
["000289.000554.001135","CE Attività DIST GAS",289,1135,554,"Invariata","DIST GAS","          - accantonamenti per rischi ","          - accantonamenti per rischi ","          - accantonamenti per rischi "]
["000289.000308.000558","CE Attività DIST GAS",289,558,308,"Invariata","DIST GAS","    13) Altri accantonamenti","    13) Altri accantonamenti","    13) Altri accantonamenti"]
["000289.000558.000559","CE Attività DIST GAS",289,559,558,"Invariata","DIST GAS","       Altri accantonamenti","       Altri accantonamenti","       Altri accantonamenti"]
["000289.000308.000560","CE Attività DIST GAS",289,560,308,"Invariata","DIST GAS","    14) Oneri diversi di gestione","    14) Oneri diversi di gestione","    14) Oneri diversi di gestione"]
["000289.000560.002006","CE Attività DIST GAS",289,2006,560,"Invariata","DIST GAS","   Oneri diversi di gestione","   Oneri diversi di gestione","   Oneri diversi di gestione"]
["000289.000308.012515","CE Attività DIST GAS",289,12515,308,"Invariata","DIST GAS","    14-bis ) oneri non ricorrenti","    14-bis ) oneri non ricorrenti","    14-bis ) oneri non ricorrenti"]
["000289.000307.000574","CE Attività DIST GAS",289,574,307,"Invariata","DIST GAS","  ACQUISTI INTERNI","  ACQUISTI INTERNI","  ACQUISTI INTERNI"]
["000289.000574.010916","CE Attività DIST GAS",289,10916,574,"Invariata","DIST GAS","       Acquisto interno di beni e servizi da altre attività a prezzo di mercato","       Acquisto interno di beni e servizi da altre attività a prezzo di mercato","       Acquisto interno di beni e servizi da altre attività a prezzo di mercato"]
["000289.000000.001142","CE Attività DIST GAS",289,1142,null,"Invariata","DIST GAS","DIFFERENZA TRA VALORE E COSTI DELLA PRODUZIONE","DIFFERENZA TRA VALORE E COSTI DELLA PRODUZIONE","DIFFERENZA TRA VALORE E COSTI DELLA PRODUZIONE"]
["000289.000000.000603","CE Attività DIST GAS",289,603,null,"Invariata","DIST GAS","   COSTI INDIRETTI","   COSTI INDIRETTI","   COSTI INDIRETTI"]
["000289.000603.000605","CE Attività DIST GAS",289,605,603,"Invariata","DIST GAS","       Costi attribuiti dalle funzioni operative condivise","       Costi attribuiti dalle funzioni operative condivise","       Costi attribuiti dalle funzioni operative condivise"]
["000289.000605.000608","CE Attività DIST GAS",289,608,605,"Invariata","DIST GAS","       Funzione operativa condivisa di misura tra attività di settori diversi o tra attività diverse del settore idrico","       Funzione operativa condivisa di misura tra attività di settori diversi o tra attività diverse del settore idrico","       Funzione operativa condivisa di misura tra attività di settori diversi o tra attività diverse del settore idrico"]
["000289.000605.000610","CE Attività DIST GAS",289,610,605,"Invariata","DIST GAS","          Funzione operativa condivisa di cartografia elettronica","          Funzione operativa condivisa di cartografia elettronica","          Funzione operativa condivisa di cartografia elettronica"]
["000289.000605.010937","CE Attività DIST GAS",289,10937,605,"Invariata","DIST GAS","       Funzione operativa condivisa commerciale, di vendita e gestione clientela del settore elettrico","       Funzione operativa condivisa commerciale, di vendita e gestione clientela del settore elettrico","       Funzione operativa condivisa commerciale, di vendita e gestione clientela del settore elettrico"]
["000289.000605.010938","CE Attività DIST GAS",289,10938,605,"Invariata","DIST GAS","       Funzione operativa condivisa commerciale, di vendita e gestione clientela del settore gas","       Funzione operativa condivisa commerciale, di vendita e gestione clientela del settore gas","       Funzione operativa condivisa commerciale, di vendita e gestione clientela del settore gas"]
["000289.000605.010939","CE Attività DIST GAS",289,10939,605,"Invariata","DIST GAS","       Funzione operativa condivisa commerciale, di vendita e gestione clientela comune al settore elettrico e gas","       Funzione operativa condivisa commerciale, di vendita e gestione clientela comune al settore elettrico e gas","       Funzione operativa condivisa commerciale, di vendita e gestione clientela comune al settore elettrico e gas"]
["000289.000605.010940","CE Attività DIST GAS",289,10940,605,"Invariata","DIST GAS","       Funzione operativa condivisa di acquisto di energia elettrica","       Funzione operativa condivisa di acquisto di energia elettrica","       Funzione operativa condivisa di acquisto di energia elettrica"]
["000289.000605.010941","CE Attività DIST GAS",289,10941,605,"Invariata","DIST GAS","       Funzione operativa condivisa di acquisto di gas","       Funzione operativa condivisa di acquisto di gas","       Funzione operativa condivisa di acquisto di gas"]
["000289.000605.010942","CE Attività DIST GAS",289,10942,605,"Invariata","DIST GAS","       Funzione operativa condivisa di acquisto comune di energia elettrica e di gas","       Funzione operativa condivisa di acquisto comune di energia elettrica e di gas","       Funzione operativa condivisa di acquisto comune di energia elettrica e di gas"]
["000289.000605.011512","CE Attività DIST GAS",289,11512,605,"Invariata","DIST GAS","       Funzione operativa condivisa di verifica e controllo","       Funzione operativa condivisa di verifica e controllo","       Funzione operativa condivisa di verifica e controllo"]
["000289.000605.011517","CE Attività DIST GAS",289,11517,605,"Invariata","DIST GAS","       Funzione operativa condivisa di telecontrollo e ricerca perdite","       Funzione operativa condivisa di telecontrollo e ricerca perdite","       Funzione operativa condivisa di telecontrollo e ricerca perdite"]
["000289.000605.011521","CE Attività DIST GAS",289,11521,605,"Invariata","DIST GAS","       Funzione operativa condivisa di manutenzione e servizi tecnici","       Funzione operativa condivisa di manutenzione e servizi tecnici","       Funzione operativa condivisa di manutenzione e servizi tecnici"]
["000289.000603.000612","CE Attività DIST GAS",289,612,603,"Invariata","DIST GAS","       Costi attribuiti dai servizi comuni","       Costi attribuiti dai servizi comuni","       Costi attribuiti dai servizi comuni"]
["000289.000612.002010","CE Attività DIST GAS",289,2010,612,"Invariata","DIST GAS","          Costi attribuiti dai servizi comuni","          Costi attribuiti dai servizi comuni","          Costi attribuiti dai servizi comuni"]
[{"$f":"CONCATENATE(TEXT(C804,\"000000\"),\".\",TEXT(E804,\"000000\"),\".\",TEXT(D804,\"000000\"))","v":"000289.000603.010957"},"CE Attività DIST GAS",289,10957,603,"Invariata","DIST GAS","       Acquisto interno di beni e servizi da altre attività a costo pieno","       Acquisto interno di beni e servizi da altre attività a costo pieno","       Acquisto interno di beni e servizi da altre attività a costo pieno"]
["000289.000000.001143","CE Attività DIST GAS",289,1143,null,"Invariata","DIST GAS","COSTI DELLA PRODUZIONE (DIRETTI + INDIRETTI)","COSTI DELLA PRODUZIONE (DIRETTI + INDIRETTI)","COSTI DELLA PRODUZIONE (DIRETTI + INDIRETTI)"]
["000289.000000.002009","CE Attività DIST GAS",289,2009,null,"Invariata","DIST GAS","DIFFERENZA TRA VALORE E COSTI DELLA PRODUZIONE DOPO TRANSAZIONI INTERNE","DIFFERENZA TRA VALORE E COSTI DELLA PRODUZIONE DOPO TRANSAZIONI INTERNE","DIFFERENZA TRA VALORE E COSTI DELLA PRODUZIONE DOPO TRANSAZIONI INTERNE"]
["000289.000000.001144","CE Attività DIST GAS",289,1144,null,"Invariata","DIST GAS","DIFFERENZA TRA VALORE E COSTI DELLA PRODUZIONE DOPO TRANSAZIONI INTERNE E ATTRIBUZIONE DEI VALORI RELATIVI ALLE FUNZIONI OPERATIVE CONDIVISE E AI SERVIZI COMUNI","DIFFERENZA TRA VALORE E COSTI DELLA PRODUZIONE DOPO TRANSAZIONI INTERNE E ATTRIBUZIONE DEI VALORI RELATIVI ALLE FUNZIONI OPERATIVE CONDIVISE E AI SERVIZI COMUNI","DIFFERENZA TRA VALORE E COSTI DELLA PRODUZIONE DOPO TRANSAZIONI INTERNE E ATTRIBUZIONE DEI VALORI RELATIVI ALLE FUNZIONI OPERATIVE CONDIVISE E AI SERVIZI COMUNI"]
["000290.000000.000001","CE Attività MIS GAS",290,1,null,"Invariata","MIS GAS","  A.1) VALORE DELLA PRODUZIONE COMPRENSIVO DELLE VENDITE INTERNE","  A.1) VALORE DELLA PRODUZIONE COMPRENSIVO DELLE VENDITE INTERNE","  A.1) VALORE DELLA PRODUZIONE COMPRENSIVO DELLE VENDITE INTERNE"]
["000290.000001.000002","CE Attività MIS GAS",290,2,1,"Invariata","MIS GAS","  A) VALORE DELLA PRODUZIONE","  A) VALORE DELLA PRODUZIONE","  A) VALORE DELLA PRODUZIONE"]
["000290.000002.000003","CE Attività MIS GAS",290,3,2,"Invariata","MIS GAS","    1) Ricavi delle vendite e delle prestazioni","    1) Ricavi delle vendite e delle prestazioni","    1) Ricavi delle vendite e delle prestazioni"]
["000290.000003.001149","CE Attività MIS GAS",290,1149,3,"Invariata","MIS GAS"," Ricavi dalle vendite e dalle prestazioni"," Ricavi dalle vendite e dalle prestazioni"," Ricavi dalle vendite e dalle prestazioni"]
["000290.000002.000253","CE Attività MIS GAS",290,253,2,"Invariata","MIS GAS","    2) Variazioni delle rimanenze di prodotti in corso di lavorazione, semilavorati e finiti","    2) Variazioni delle rimanenze di prodotti in corso di lavorazione, semilavorati e finiti","    2) Variazioni delle rimanenze di prodotti in corso di lavorazione, semilavorati e finiti"]
["000290.000253.000254","CE Attività MIS GAS",290,254,253,"Invariata","MIS GAS","       Variazioni delle rimanenze di prodotti in corso di lavorazione, semilavorati e finiti","       Variazioni delle rimanenze di prodotti in corso di lavorazione, semilavorati e finiti","       Variazioni delle rimanenze di prodotti in corso di lavorazione, semilavorati e finiti"]
["000290.000002.000255","CE Attività MIS GAS",290,255,2,"Invariata","MIS GAS","    3) Variazioni dei lavori in corso su ordinazioni","    3) Variazioni dei lavori in corso su ordinazioni","    3) Variazioni dei lavori in corso su ordinazioni"]
["000290.000255.000256","CE Attività MIS GAS",290,256,255,"Invariata","MIS GAS","       Variazioni dei lavori in corso su ordinazione","       Variazioni dei lavori in corso su ordinazione","       Variazioni dei lavori in corso su ordinazione"]
["000290.000002.000257","CE Attività MIS GAS",290,257,2,"Invariata","MIS GAS","    4) Incrementi di immobilizzazioni per lavori interni ","    4) Incrementi di immobilizzazioni per lavori interni ","    4) Incrementi di immobilizzazioni per lavori interni "]
["000290.000257.002001","CE Attività MIS GAS",290,2001,257,"Invariata","MIS GAS","  Incrementi di immobilizzazioni per lavori interni ","  Incrementi di immobilizzazioni per lavori interni ","  Incrementi di immobilizzazioni per lavori interni "]
["000290.000002.011466","CE Attività MIS GAS",290,11466,2,"Invariata","MIS GAS","    5) Altri ricavi e proventi, con separata indicazione dei contributi in conto esercizio","    5) Altri ricavi e proventi, con separata indicazione dei contributi in conto esercizio","    5) Altri ricavi e proventi, con separata indicazione dei contributi in conto esercizio"]
["000290.011466.011457","CE Attività MIS GAS",290,11457,11466,"Invariata","MIS GAS","   Altri ricavi e proventi","   Altri ricavi e proventi","   Altri ricavi e proventi"]
["000290.000002.012514","CE Attività MIS GAS",290,12514,2,"Invariata","MIS GAS","    5-bis) ricavi non ricorrenti","    5-bis) ricavi non ricorrenti","    5-bis) ricavi non ricorrenti"]
["000290.000001.000302","CE Attività MIS GAS",290,302,1,"Invariata","MIS GAS","  VENDITE INTERNE","  VENDITE INTERNE","  VENDITE INTERNE"]
["000290.000302.000304","CE Attività MIS GAS",290,304,302,"Invariata","MIS GAS","    Vendita interna di beni e servizi ad altre attività a prezzo di mercato","    Vendita interna di beni e servizi ad altre attività a prezzo di mercato","    Vendita interna di beni e servizi ad altre attività a prezzo di mercato"]
["000290.000302.010968","CE Attività MIS GAS",290,10968,302,"Invariata","MIS GAS","    Vendita interna di beni e servizi ad altre attività a costo pieno","    Vendita interna di beni e servizi ad altre attività a costo pieno","    Vendita interna di beni e servizi ad altre attività a costo pieno"]
["000290.000000.000307","CE Attività MIS GAS",290,307,null,"Invariata","MIS GAS","B.1) COSTI DELLA PRODUZIONE COMPRENSIVI DEGLI ACQUISTI INTERNI","B.1) COSTI DELLA PRODUZIONE COMPRENSIVI DEGLI ACQUISTI INTERNI","B.1) COSTI DELLA PRODUZIONE COMPRENSIVI DEGLI ACQUISTI INTERNI"]
["000290.000307.000308","CE Attività MIS GAS",290,308,307,"Invariata","MIS GAS","  B) COSTI DELLA PRODUZIONE","  B) COSTI DELLA PRODUZIONE","  B) COSTI DELLA PRODUZIONE"]
["000290.000308.000309","CE Attività MIS GAS",290,309,308,"Invariata","MIS GAS","    6) Per materie prime, sussidiarie, di consumo e di merci (a livello di attività vanno riportati i consumi)","    6) Per materie prime, sussidiarie, di consumo e di merci (a livello di attività vanno riportati i consumi)","    6) Per materie prime, sussidiarie, di consumo e di merci (a livello di attività vanno riportati i consumi)"]
["000290.000309.002007","CE Attività MIS GAS",290,2007,309,"Invariata","MIS GAS","Per acquisto e trasporto dell'energia","Per acquisto e trasporto dell'energia","Per acquisto e trasporto dell'energia"]
["000290.000309.002008","CE Attività MIS GAS",290,2008,309,"Invariata","MIS GAS","Altri costi di materie prime, sussidiarie, di consumo e di merci","Altri costi di materie prime, sussidiarie, di consumo e di merci","Altri costi di materie prime, sussidiarie, di consumo e di merci"]
["000290.000308.000416","CE Attività MIS GAS",290,416,308,"Invariata","MIS GAS","    7) Per servizi","    7) Per servizi","    7) Per servizi"]
["000290.000416.002003","CE Attività MIS GAS",290,2003,416,"Invariata","MIS GAS","     Per servizi","     Per servizi","     Per servizi"]
["000290.000308.000511","CE Attività MIS GAS",290,511,308,"Invariata","MIS GAS","    8) Per godimento beni di terzi","    8) Per godimento beni di terzi","    8) Per godimento beni di terzi"]
["000290.000511.002004","CE Attività MIS GAS",290,2004,511,"Invariata","MIS GAS","          Per godimento beni di terzi","          Per godimento beni di terzi","          Per godimento beni di terzi"]
["000290.000308.000532","CE Attività MIS GAS",290,532,308,"Invariata","MIS GAS","    9) Per il personale ","    9) Per il personale ","    9) Per il personale "]
["000290.000532.002005","CE Attività MIS GAS",290,2005,532,"Invariata","MIS GAS","    Per il personale ","    Per il personale ","    Per il personale "]
["000290.000308.000544","CE Attività MIS GAS",290,544,308,{"$f":"IF(TRIM(H835)=TRIM(I835),\"Invariata\",IF(H835=\"\",\"Aggiunta\",IF(I835=\"\",\"Eliminata\",\"Modificata\")))","v":"Invariata"},"MIS GAS","    10) Ammortamenti e svalutazioni","    10) Ammortamenti e svalutazioni","    10) Ammortamenti e svalutazioni"]
["000290.000544.000545","CE Attività MIS GAS",290,545,544,"Invariata","MIS GAS","       Ammortamento delle immobilizzazioni immateriali","       Ammortamento delle immobilizzazioni immateriali","       Ammortamento delle immobilizzazioni immateriali"]
["000290.000544.000547","CE Attività MIS GAS",290,547,544,"Invariata","MIS GAS","       Ammortamento delle immobilizzazioni materiali (ammortamento tecnicoeconomico)","       Ammortamento delle immobilizzazioni materiali (ammortamento tecnicoeconomico)","       Ammortamento delle immobilizzazioni materiali (ammortamento tecnicoeconomico)"]
["000290.000544.000548","CE Attività MIS GAS",290,548,544,"Invariata","MIS GAS","       Ammortamento delle immobilizzazioni materiali (ammortamento finanziario)","       Ammortamento delle immobilizzazioni materiali (ammortamento finanziario)","       Ammortamento delle immobilizzazioni materiali (ammortamento finanziario)"]
["000290.000544.000549","CE Attività MIS GAS",290,549,544,"Invariata","MIS GAS","       Altre svalutazioni delle immobilizzazioni","       Altre svalutazioni delle immobilizzazioni","       Altre svalutazioni delle immobilizzazioni"]
["000290.000544.000550","CE Attività MIS GAS",290,550,544,"Invariata","MIS GAS","       Svalutazione dei crediti compresi nell'attivo circolante e delle disponibilità","       Svalutazione dei crediti compresi nell'attivo circolante e delle disponibilità","       Svalutazione dei crediti compresi nell'attivo circolante e delle disponibilità"]
["000290.000308.000554","CE Attività MIS GAS",290,554,308,"Invariata","MIS GAS","    12) Accantonamenti per rischi","    12) Accantonamenti per rischi","    12) Accantonamenti per rischi"]
["000290.000554.001135","CE Attività MIS GAS",290,1135,554,"Invariata","MIS GAS","          - accantonamenti per rischi ","          - accantonamenti per rischi ","          - accantonamenti per rischi "]
["000290.000308.000558","CE Attività MIS GAS",290,558,308,"Invariata","MIS GAS","    13) Altri accantonamenti","    13) Altri accantonamenti","    13) Altri accantonamenti"]
["000290.000558.000559","CE Attività MIS GAS",290,559,558,"Invariata","MIS GAS","       Altri accantonamenti","       Altri accantonamenti","       Altri accantonamenti"]
["000290.000308.000560","CE Attività MIS GAS",290,560,308,"Invariata","MIS GAS","    14) Oneri diversi di gestione","    14) Oneri diversi di gestione","    14) Oneri diversi di gestione"]
["000290.000560.002006","CE Attività MIS GAS",290,2006,560,"Invariata","MIS GAS","   Oneri diversi di gestione","   Oneri diversi di gestione","   Oneri diversi di gestione"]
["000290.000308.012515","CE Attività MIS GAS",290,12515,308,"Invariata","MIS GAS","    14-bis ) oneri non ricorrenti","    14-bis ) oneri non ricorrenti","    14-bis ) oneri non ricorrenti"]
["000290.000307.000574","CE Attività MIS GAS",290,574,307,"Invariata","MIS GAS","  ACQUISTI INTERNI","  ACQUISTI INTERNI","  ACQUISTI INTERNI"]
["000290.000574.010916","CE Attività MIS GAS",290,10916,574,"Invariata","MIS GAS","       Acquisto interno di beni e servizi da altre attività a prezzo di mercato","       Acquisto interno di beni e servizi da altre attività a prezzo di mercato","       Acquisto interno di beni e servizi da altre attività a prezzo di mercato"]
["000290.000000.001142","CE Attività MIS GAS",290,1142,null,"Invariata","MIS GAS","DIFFERENZA TRA VALORE E COSTI DELLA PRODUZIONE","DIFFERENZA TRA VALORE E COSTI DELLA PRODUZIONE","DIFFERENZA TRA VALORE E COSTI DELLA PRODUZIONE"]
["000290.000000.000603","CE Attività MIS GAS",290,603,null,"Invariata","MIS GAS","   COSTI INDIRETTI","   COSTI INDIRETTI","   COSTI INDIRETTI"]
["000290.000603.000605","CE Attività MIS GAS",290,605,603,"Invariata","MIS GAS","       Costi attribuiti dalle funzioni operative condivise","       Costi attribuiti dalle funzioni operative condivise","       Costi attribuiti dalle funzioni operative condivise"]
["000290.000605.000608","CE Attività MIS GAS",290,608,605,"Invariata","MIS GAS","       Funzione operativa condivisa di misura tra attività di settori diversi o tra attività diverse del settore idrico","       Funzione operativa condivisa di misura tra attività di settori diversi o tra attività diverse del settore idrico","       Funzione operativa condivisa di misura tra attività di settori diversi o tra attività diverse del settore idrico"]
["000290.000605.000610","CE Attività MIS GAS",290,610,605,"Invariata","MIS GAS","          Funzione operativa condivisa di cartografia elettronica","          Funzione operativa condivisa di cartografia elettronica","          Funzione operativa condivisa di cartografia elettronica"]
["000290.000605.010937","CE Attività MIS GAS",290,10937,605,"Invariata","MIS GAS","       Funzione operativa condivisa commerciale, di vendita e gestione clientela del settore elettrico","       Funzione operativa condivisa commerciale, di vendita e gestione clientela del settore elettrico","       Funzione operativa condivisa commerciale, di vendita e gestione clientela del settore elettrico"]
["000290.000605.010938","CE Attività MIS GAS",290,10938,605,"Invariata","MIS GAS","       Funzione operativa condivisa commerciale, di vendita e gestione clientela del settore gas","       Funzione operativa condivisa commerciale, di vendita e gestione clientela del settore gas","       Funzione operativa condivisa commerciale, di vendita e gestione clientela del settore gas"]
["000290.000605.010939","CE Attività MIS GAS",290,10939,605,"Invariata","MIS GAS","       Funzione operativa condivisa commerciale, di vendita e gestione clientela comune al settore elettrico e gas","       Funzione operativa condivisa commerciale, di vendita e gestione clientela comune al settore elettrico e gas","       Funzione operativa condivisa commerciale, di vendita e gestione clientela comune al settore elettrico e gas"]
["000290.000605.010940","CE Attività MIS GAS",290,10940,605,"Invariata","MIS GAS","       Funzione operativa condivisa di acquisto di energia elettrica","       Funzione operativa condivisa di acquisto di energia elettrica","       Funzione operativa condivisa di acquisto di energia elettrica"]
["000290.000605.010941","CE Attività MIS GAS",290,10941,605,"Invariata","MIS GAS","       Funzione operativa condivisa di acquisto di gas","       Funzione operativa condivisa di acquisto di gas","       Funzione operativa condivisa di acquisto di gas"]
["000290.000605.010942","CE Attività MIS GAS",290,10942,605,"Invariata","MIS GAS","       Funzione operativa condivisa di acquisto comune di energia elettrica e di gas","       Funzione operativa condivisa di acquisto comune di energia elettrica e di gas","       Funzione operativa condivisa di acquisto comune di energia elettrica e di gas"]
["000290.000605.011512","CE Attività MIS GAS",290,11512,605,"Invariata","MIS GAS","       Funzione operativa condivisa di verifica e controllo","       Funzione operativa condivisa di verifica e controllo","       Funzione operativa condivisa di verifica e controllo"]
["000290.000605.011517","CE Attività MIS GAS",290,11517,605,"Invariata","MIS GAS","       Funzione operativa condivisa di telecontrollo e ricerca perdite","       Funzione operativa condivisa di telecontrollo e ricerca perdite","       Funzione operativa condivisa di telecontrollo e ricerca perdite"]
["000290.000605.011521","CE Attività MIS GAS",290,11521,605,"Invariata","MIS GAS","       Funzione operativa condivisa di manutenzione e servizi tecnici","       Funzione operativa condivisa di manutenzione e servizi tecnici","       Funzione operativa condivisa di manutenzione e servizi tecnici"]
["000290.000603.000612","CE Attività MIS GAS",290,612,603,"Invariata","MIS GAS","       Costi attribuiti dai servizi comuni","       Costi attribuiti dai servizi comuni","       Costi attribuiti dai servizi comuni"]
["000290.000612.002010","CE Attività MIS GAS",290,2010,612,"Invariata","MIS GAS","          Costi attribuiti dai servizi comuni","          Costi attribuiti dai servizi comuni","          Costi attribuiti dai servizi comuni"]
["000290.000603.010957","CE Attività MIS GAS",290,10957,603,"Invariata","MIS GAS","       Acquisto interno di beni e servizi da altre attività a costo pieno","       Acquisto interno di beni e servizi da altre attività a costo pieno","       Acquisto interno di beni e servizi da altre attività a costo pieno"]
["000290.000000.001143","CE Attività MIS GAS",290,1143,null,"Invariata","MIS GAS","COSTI DELLA PRODUZIONE (DIRETTI + INDIRETTI)","COSTI DELLA PRODUZIONE (DIRETTI + INDIRETTI)","COSTI DELLA PRODUZIONE (DIRETTI + INDIRETTI)"]
[{"$f":"CONCATENATE(TEXT(C868,\"000000\"),\".\",TEXT(E868,\"000000\"),\".\",TEXT(D868,\"000000\"))","v":"000290.000000.002009"},"CE Attività MIS GAS",290,2009,null,"Invariata","MIS GAS","DIFFERENZA TRA VALORE E COSTI DELLA PRODUZIONE DOPO TRANSAZIONI INTERNE","DIFFERENZA TRA VALORE E COSTI DELLA PRODUZIONE DOPO TRANSAZIONI INTERNE","DIFFERENZA TRA VALORE E COSTI DELLA PRODUZIONE DOPO TRANSAZIONI INTERNE"]
["000290.000000.001144","CE Attività MIS GAS",290,1144,null,"Invariata","MIS GAS","DIFFERENZA TRA VALORE E COSTI DELLA PRODUZIONE DOPO TRANSAZIONI INTERNE E ATTRIBUZIONE DEI VALORI RELATIVI ALLE FUNZIONI OPERATIVE CONDIVISE E AI SERVIZI COMUNI","DIFFERENZA TRA VALORE E COSTI DELLA PRODUZIONE DOPO TRANSAZIONI INTERNE E ATTRIBUZIONE DEI VALORI RELATIVI ALLE FUNZIONI OPERATIVE CONDIVISE E AI SERVIZI COMUNI","DIFFERENZA TRA VALORE E COSTI DELLA PRODUZIONE DOPO TRANSAZIONI INTERNE E ATTRIBUZIONE DEI VALORI RELATIVI ALLE FUNZIONI OPERATIVE CONDIVISE E AI SERVIZI COMUNI"]
["100841.000000.000001","CE Attività VEN I GAS",100841,1,null,"Invariata","VEN I GAS","  A.1) VALORE DELLA PRODUZIONE COMPRENSIVO DELLE VENDITE INTERNE","  A.1) VALORE DELLA PRODUZIONE COMPRENSIVO DELLE VENDITE INTERNE","  A.1) VALORE DELLA PRODUZIONE COMPRENSIVO DELLE VENDITE INTERNE"]
["100841.000001.000002","CE Attività VEN I GAS",100841,2,1,"Invariata","VEN I GAS","  A) VALORE DELLA PRODUZIONE","  A) VALORE DELLA PRODUZIONE","  A) VALORE DELLA PRODUZIONE"]
["100841.000002.000003","CE Attività VEN I GAS",100841,3,2,"Invariata","VEN I GAS","    1) Ricavi delle vendite e delle prestazioni","    1) Ricavi delle vendite e delle prestazioni","    1) Ricavi delle vendite e delle prestazioni"]
["100841.000003.001149","CE Attività VEN I GAS",100841,1149,3,"Invariata","VEN I GAS"," Ricavi dalle vendite e dalle prestazioni"," Ricavi dalle vendite e dalle prestazioni"," Ricavi dalle vendite e dalle prestazioni"]
["100841.000002.000253","CE Attività VEN I GAS",100841,253,2,"Invariata","VEN I GAS","    2) Variazioni delle rimanenze di prodotti in corso di lavorazione, semilavorati e finiti","    2) Variazioni delle rimanenze di prodotti in corso di lavorazione, semilavorati e finiti","    2) Variazioni delle rimanenze di prodotti in corso di lavorazione, semilavorati e finiti"]
["100841.000253.000254","CE Attività VEN I GAS",100841,254,253,"Invariata","VEN I GAS","       Variazioni delle rimanenze di prodotti in corso di lavorazione, semilavorati e finiti","       Variazioni delle rimanenze di prodotti in corso di lavorazione, semilavorati e finiti","       Variazioni delle rimanenze di prodotti in corso di lavorazione, semilavorati e finiti"]
["100841.000002.000255","CE Attività VEN I GAS",100841,255,2,"Invariata","VEN I GAS","    3) Variazioni dei lavori in corso su ordinazioni","    3) Variazioni dei lavori in corso su ordinazioni","    3) Variazioni dei lavori in corso su ordinazioni"]
["100841.000255.000256","CE Attività VEN I GAS",100841,256,255,"Invariata","VEN I GAS","       Variazioni dei lavori in corso su ordinazione","       Variazioni dei lavori in corso su ordinazione","       Variazioni dei lavori in corso su ordinazione"]
["100841.000002.000257","CE Attività VEN I GAS",100841,257,2,"Invariata","VEN I GAS","    4) Incrementi di immobilizzazioni per lavori interni ","    4) Incrementi di immobilizzazioni per lavori interni ","    4) Incrementi di immobilizzazioni per lavori interni "]
["100841.000257.002001","CE Attività VEN I GAS",100841,2001,257,"Invariata","VEN I GAS","  Incrementi di immobilizzazioni per lavori interni ","  Incrementi di immobilizzazioni per lavori interni ","  Incrementi di immobilizzazioni per lavori interni "]
["100841.000002.011466","CE Attività VEN I GAS",100841,11466,2,"Invariata","VEN I GAS","    5) Altri ricavi e proventi, con separata indicazione dei contributi in conto esercizio","    5) Altri ricavi e proventi, con separata indicazione dei contributi in conto esercizio","    5) Altri ricavi e proventi, con separata indicazione dei contributi in conto esercizio"]
["100841.011466.011457","CE Attività VEN I GAS",100841,11457,11466,"Invariata","VEN I GAS","   Altri ricavi e proventi","   Altri ricavi e proventi","   Altri ricavi e proventi"]
["100841.000002.012514","CE Attività VEN I GAS",100841,12514,2,"Invariata","VEN I GAS","    5-bis) ricavi non ricorrenti","    5-bis) ricavi non ricorrenti","    5-bis) ricavi non ricorrenti"]
["100841.000001.000302","CE Attività VEN I GAS",100841,302,1,"Invariata","VEN I GAS","  VENDITE INTERNE","  VENDITE INTERNE","  VENDITE INTERNE"]
["100841.000302.000304","CE Attività VEN I GAS",100841,304,302,"Invariata","VEN I GAS","    Vendita interna di beni e servizi ad altre attività a prezzo di mercato","    Vendita interna di beni e servizi ad altre attività a prezzo di mercato","    Vendita interna di beni e servizi ad altre attività a prezzo di mercato"]
["100841.000302.010968","CE Attività VEN I GAS",100841,10968,302,"Invariata","VEN I GAS","    Vendita interna di beni e servizi ad altre attività a costo pieno","    Vendita interna di beni e servizi ad altre attività a costo pieno","    Vendita interna di beni e servizi ad altre attività a costo pieno"]
["100841.000000.000307","CE Attività VEN I GAS",100841,307,null,"Invariata","VEN I GAS","B.1) COSTI DELLA PRODUZIONE COMPRENSIVI DEGLI ACQUISTI INTERNI","B.1) COSTI DELLA PRODUZIONE COMPRENSIVI DEGLI ACQUISTI INTERNI","B.1) COSTI DELLA PRODUZIONE COMPRENSIVI DEGLI ACQUISTI INTERNI"]
["100841.000307.000308","CE Attività VEN I GAS",100841,308,307,"Invariata","VEN I GAS","  B) COSTI DELLA PRODUZIONE","  B) COSTI DELLA PRODUZIONE","  B) COSTI DELLA PRODUZIONE"]
["100841.000308.000309","CE Attività VEN I GAS",100841,309,308,"Invariata","VEN I GAS","    6) Per materie prime, sussidiarie, di consumo e di merci (a livello di attività vanno riportati i consumi)","    6) Per materie prime, sussidiarie, di consumo e di merci (a livello di attività vanno riportati i consumi)","    6) Per materie prime, sussidiarie, di consumo e di merci (a livello di attività vanno riportati i consumi)"]
["100841.000309.002007","CE Attività VEN I GAS",100841,2007,309,"Invariata","VEN I GAS","Per acquisto e trasporto dell'energia","Per acquisto e trasporto dell'energia","Per acquisto e trasporto dell'energia"]
["100841.000309.002008","CE Attività VEN I GAS",100841,2008,309,"Invariata","VEN I GAS","Altri costi di materie prime, sussidiarie, di consumo e di merci","Altri costi di materie prime, sussidiarie, di consumo e di merci","Altri costi di materie prime, sussidiarie, di consumo e di merci"]
["100841.000308.000416","CE Attività VEN I GAS",100841,416,308,"Invariata","VEN I GAS","    7) Per servizi","    7) Per servizi","    7) Per servizi"]
["100841.000416.002003","CE Attività VEN I GAS",100841,2003,416,"Invariata","VEN I GAS","     Per servizi","     Per servizi","     Per servizi"]
["100841.000308.000511","CE Attività VEN I GAS",100841,511,308,"Invariata","VEN I GAS","    8) Per godimento beni di terzi","    8) Per godimento beni di terzi","    8) Per godimento beni di terzi"]
["100841.000511.002004","CE Attività VEN I GAS",100841,2004,511,"Invariata","VEN I GAS","          Per godimento beni di terzi","          Per godimento beni di terzi","          Per godimento beni di terzi"]
["100841.000308.000532","CE Attività VEN I GAS",100841,532,308,"Invariata","VEN I GAS","    9) Per il personale ","    9) Per il personale ","    9) Per il personale "]
["100841.000532.002005","CE Attività VEN I GAS",100841,2005,532,"Invariata","VEN I GAS","    Per il personale ","    Per il personale ","    Per il personale "]
["100841.000308.000544","CE Attività VEN I GAS",100841,544,308,"Invariata","VEN I GAS","    10) Ammortamenti e svalutazioni","    10) Ammortamenti e svalutazioni","    10) Ammortamenti e svalutazioni"]
["100841.000544.000545","CE Attività VEN I GAS",100841,545,544,"Invariata","VEN I GAS","       Ammortamento delle immobilizzazioni immateriali","       Ammortamento delle immobilizzazioni immateriali","       Ammortamento delle immobilizzazioni immateriali"]
["100841.000544.000547","CE Attività VEN I GAS",100841,547,544,{"$f":"IF(TRIM(H899)=TRIM(I899),\"Invariata\",IF(H899=\"\",\"Aggiunta\",IF(I899=\"\",\"Eliminata\",\"Modificata\")))","v":"Invariata"},"VEN I GAS","       Ammortamento delle immobilizzazioni materiali (ammortamento tecnicoeconomico)","       Ammortamento delle immobilizzazioni materiali (ammortamento tecnicoeconomico)","       Ammortamento delle immobilizzazioni materiali (ammortamento tecnicoeconomico)"]
["100841.000544.000548","CE Attività VEN I GAS",100841,548,544,"Invariata","VEN I GAS","       Ammortamento delle immobilizzazioni materiali (ammortamento finanziario)","       Ammortamento delle immobilizzazioni materiali (ammortamento finanziario)","       Ammortamento delle immobilizzazioni materiali (ammortamento finanziario)"]
["100841.000544.000549","CE Attività VEN I GAS",100841,549,544,"Invariata","VEN I GAS","       Altre svalutazioni delle immobilizzazioni","       Altre svalutazioni delle immobilizzazioni","       Altre svalutazioni delle immobilizzazioni"]
["100841.000544.000550","CE Attività VEN I GAS",100841,550,544,"Invariata","VEN I GAS","       Svalutazione dei crediti compresi nell'attivo circolante e delle disponibilità","       Svalutazione dei crediti compresi nell'attivo circolante e delle disponibilità","       Svalutazione dei crediti compresi nell'attivo circolante e delle disponibilità"]
["100841.000308.000554","CE Attività VEN I GAS",100841,554,308,"Invariata","VEN I GAS","    12) Accantonamenti per rischi","    12) Accantonamenti per rischi","    12) Accantonamenti per rischi"]
["100841.000554.001135","CE Attività VEN I GAS",100841,1135,554,"Invariata","VEN I GAS","          - accantonamenti per rischi ","          - accantonamenti per rischi ","          - accantonamenti per rischi "]
["100841.000308.000558","CE Attività VEN I GAS",100841,558,308,"Invariata","VEN I GAS","    13) Altri accantonamenti","    13) Altri accantonamenti","    13) Altri accantonamenti"]
["100841.000558.000559","CE Attività VEN I GAS",100841,559,558,"Invariata","VEN I GAS","       Altri accantonamenti","       Altri accantonamenti","       Altri accantonamenti"]
["100841.000308.000560","CE Attività VEN I GAS",100841,560,308,"Invariata","VEN I GAS","    14) Oneri diversi di gestione","    14) Oneri diversi di gestione","    14) Oneri diversi di gestione"]
["100841.000560.002006","CE Attività VEN I GAS",100841,2006,560,"Invariata","VEN I GAS","   Oneri diversi di gestione","   Oneri diversi di gestione","   Oneri diversi di gestione"]
["100841.000308.012515","CE Attività VEN I GAS",100841,12515,308,"Invariata","VEN I GAS","    14-bis ) oneri non ricorrenti","    14-bis ) oneri non ricorrenti","    14-bis ) oneri non ricorrenti"]
["100841.000307.000574","CE Attività VEN I GAS",100841,574,307,"Invariata","VEN I GAS","  ACQUISTI INTERNI","  ACQUISTI INTERNI","  ACQUISTI INTERNI"]
["100841.000574.010916","CE Attività VEN I GAS",100841,10916,574,"Invariata","VEN I GAS","       Acquisto interno di beni e servizi da altre attività a prezzo di mercato","       Acquisto interno di beni e servizi da altre attività a prezzo di mercato","       Acquisto interno di beni e servizi da altre attività a prezzo di mercato"]
["100841.000000.001142","CE Attività VEN I GAS",100841,1142,null,"Invariata","VEN I GAS","DIFFERENZA TRA VALORE E COSTI DELLA PRODUZIONE","DIFFERENZA TRA VALORE E COSTI DELLA PRODUZIONE","DIFFERENZA TRA VALORE E COSTI DELLA PRODUZIONE"]
["100841.000000.000603","CE Attività VEN I GAS",100841,603,null,"Invariata","VEN I GAS","   COSTI INDIRETTI","   COSTI INDIRETTI","   COSTI INDIRETTI"]
["100841.000603.000605","CE Attività VEN I GAS",100841,605,603,"Invariata","VEN I GAS","       Costi attribuiti dalle funzioni operative condivise","       Costi attribuiti dalle funzioni operative condivise","       Costi attribuiti dalle funzioni operative condivise"]
["100841.000605.000608","CE Attività VEN I GAS",100841,608,605,"Invariata","VEN I GAS","       Funzione operativa condivisa di misura tra attività di settori diversi o tra attività diverse del settore idrico","       Funzione operativa condivisa di misura tra attività di settori diversi o tra attività diverse del settore idrico","       Funzione operativa condivisa di misura tra attività di settori diversi o tra attività diverse del settore idrico"]
["100841.000605.000610","CE Attività VEN I GAS",100841,610,605,"Invariata","VEN I GAS","          Funzione operativa condivisa di cartografia elettronica","          Funzione operativa condivisa di cartografia elettronica","          Funzione operativa condivisa di cartografia elettronica"]
["100841.000605.010937","CE Attività VEN I GAS",100841,10937,605,"Invariata","VEN I GAS","       Funzione operativa condivisa commerciale, di vendita e gestione clientela del settore elettrico","       Funzione operativa condivisa commerciale, di vendita e gestione clientela del settore elettrico","       Funzione operativa condivisa commerciale, di vendita e gestione clientela del settore elettrico"]
["100841.000605.010938","CE Attività VEN I GAS",100841,10938,605,"Invariata","VEN I GAS","       Funzione operativa condivisa commerciale, di vendita e gestione clientela del settore gas","       Funzione operativa condivisa commerciale, di vendita e gestione clientela del settore gas","       Funzione operativa condivisa commerciale, di vendita e gestione clientela del settore gas"]
["100841.000605.010939","CE Attività VEN I GAS",100841,10939,605,"Invariata","VEN I GAS","       Funzione operativa condivisa commerciale, di vendita e gestione clientela comune al settore elettrico e gas","       Funzione operativa condivisa commerciale, di vendita e gestione clientela comune al settore elettrico e gas","       Funzione operativa condivisa commerciale, di vendita e gestione clientela comune al settore elettrico e gas"]
["100841.000605.010940","CE Attività VEN I GAS",100841,10940,605,"Invariata","VEN I GAS","       Funzione operativa condivisa di acquisto di energia elettrica","       Funzione operativa condivisa di acquisto di energia elettrica","       Funzione operativa condivisa di acquisto di energia elettrica"]
["100841.000605.010941","CE Attività VEN I GAS",100841,10941,605,"Invariata","VEN I GAS","       Funzione operativa condivisa di acquisto di gas","       Funzione operativa condivisa di acquisto di gas","       Funzione operativa condivisa di acquisto di gas"]
["100841.000605.010942","CE Attività VEN I GAS",100841,10942,605,"Invariata","VEN I GAS","       Funzione operativa condivisa di acquisto comune di energia elettrica e di gas","       Funzione operativa condivisa di acquisto comune di energia elettrica e di gas","       Funzione operativa condivisa di acquisto comune di energia elettrica e di gas"]
["100841.000605.011512","CE Attività VEN I GAS",100841,11512,605,"Invariata","VEN I GAS","       Funzione operativa condivisa di verifica e controllo","       Funzione operativa condivisa di verifica e controllo","       Funzione operativa condivisa di verifica e controllo"]
["100841.000605.011517","CE Attività VEN I GAS",100841,11517,605,"Invariata","VEN I GAS","       Funzione operativa condivisa di telecontrollo e ricerca perdite","       Funzione operativa condivisa di telecontrollo e ricerca perdite","       Funzione operativa condivisa di telecontrollo e ricerca perdite"]
["100841.000605.011521","CE Attività VEN I GAS",100841,11521,605,"Invariata","VEN I GAS","       Funzione operativa condivisa di manutenzione e servizi tecnici","       Funzione operativa condivisa di manutenzione e servizi tecnici","       Funzione operativa condivisa di manutenzione e servizi tecnici"]
["100841.000603.000612","CE Attività VEN I GAS",100841,612,603,"Invariata","VEN I GAS","       Costi attribuiti dai servizi comuni","       Costi attribuiti dai servizi comuni","       Costi attribuiti dai servizi comuni"]
["100841.000612.002010","CE Attività VEN I GAS",100841,2010,612,"Invariata","VEN I GAS","          Costi attribuiti dai servizi comuni","          Costi attribuiti dai servizi comuni","          Costi attribuiti dai servizi comuni"]
["100841.000603.010957","CE Attività VEN I GAS",100841,10957,603,"Invariata","VEN I GAS","       Acquisto interno di beni e servizi da altre attività a costo pieno","       Acquisto interno di beni e servizi da altre attività a costo pieno","       Acquisto interno di beni e servizi da altre attività a costo pieno"]
["100841.000000.001143","CE Attività VEN I GAS",100841,1143,null,"Invariata","VEN I GAS","COSTI DELLA PRODUZIONE (DIRETTI + INDIRETTI)","COSTI DELLA PRODUZIONE (DIRETTI + INDIRETTI)","COSTI DELLA PRODUZIONE (DIRETTI + INDIRETTI)"]
["100841.000000.002009","CE Attività VEN I GAS",100841,2009,null,"Invariata","VEN I GAS","DIFFERENZA TRA VALORE E COSTI DELLA PRODUZIONE DOPO TRANSAZIONI INTERNE","DIFFERENZA TRA VALORE E COSTI DELLA PRODUZIONE DOPO TRANSAZIONI INTERNE","DIFFERENZA TRA VALORE E COSTI DELLA PRODUZIONE DOPO TRANSAZIONI INTERNE"]
["100841.000000.001144","CE Attività VEN I GAS",100841,1144,null,"Invariata","VEN I GAS","DIFFERENZA TRA VALORE E COSTI DELLA PRODUZIONE DOPO TRANSAZIONI INTERNE E ATTRIBUZIONE DEI VALORI RELATIVI ALLE FUNZIONI OPERATIVE CONDIVISE E AI SERVIZI COMUNI","DIFFERENZA TRA VALORE E COSTI DELLA PRODUZIONE DOPO TRANSAZIONI INTERNE E ATTRIBUZIONE DEI VALORI RELATIVI ALLE FUNZIONI OPERATIVE CONDIVISE E AI SERVIZI COMUNI","DIFFERENZA TRA VALORE E COSTI DELLA PRODUZIONE DOPO TRANSAZIONI INTERNE E ATTRIBUZIONE DEI VALORI RELATIVI ALLE FUNZIONI OPERATIVE CONDIVISE E AI SERVIZI COMUNI"]
[{"$f":"CONCATENATE(TEXT(C932,\"000000\"),\".\",TEXT(E932,\"000000\"),\".\",TEXT(D932,\"000000\"))","v":"100830.000000.000001"},"CE Attività VEN F GAS ST",100830,1,null,"Eliminata","VEN F GAS ST","  A.1) VALORE DELLA PRODUZIONE COMPRENSIVO DELLE VENDITE INTERNE"]
["100830.000001.000002","CE Attività VEN F GAS ST",100830,2,1,"Eliminata","VEN F GAS ST","  A) VALORE DELLA PRODUZIONE"]
["100830.000002.000003","CE Attività VEN F GAS ST",100830,3,2,"Eliminata","VEN F GAS ST","    1) Ricavi delle vendite e delle prestazioni"]
["100830.000003.001149","CE Attività VEN F GAS ST",100830,1149,3,"Eliminata","VEN F GAS ST"," Ricavi dalle vendite e dalle prestazioni"]
["100830.000002.000253","CE Attività VEN F GAS ST",100830,253,2,"Eliminata","VEN F GAS ST","    2) Variazioni delle rimanenze di prodotti in corso di lavorazione, semilavorati e finiti"]
["100830.000253.000254","CE Attività VEN F GAS ST",100830,254,253,"Eliminata","VEN F GAS ST","       Variazioni delle rimanenze di prodotti in corso di lavorazione, semilavorati e finiti"]
["100830.000002.000255","CE Attività VEN F GAS ST",100830,255,2,"Eliminata","VEN F GAS ST","    3) Variazioni dei lavori in corso su ordinazioni"]
["100830.000255.000256","CE Attività VEN F GAS ST",100830,256,255,"Eliminata","VEN F GAS ST","       Variazioni dei lavori in corso su ordinazione"]
["100830.000002.000257","CE Attività VEN F GAS ST",100830,257,2,"Eliminata","VEN F GAS ST","    4) Incrementi di immobilizzazioni per lavori interni "]
["100830.000257.002001","CE Attività VEN F GAS ST",100830,2001,257,"Eliminata","VEN F GAS ST","  Incrementi di immobilizzazioni per lavori interni "]
["100830.000002.011466","CE Attività VEN F GAS ST",100830,11466,2,"Eliminata","VEN F GAS ST","    5) Altri ricavi e proventi, con separata indicazione dei contributi in conto esercizio"]
["100830.011466.011457","CE Attività VEN F GAS ST",100830,11457,11466,"Eliminata","VEN F GAS ST","   Altri ricavi e proventi"]
["100830.000002.012514","CE Attività VEN F GAS ST",100830,12514,2,"Eliminata","VEN F GAS ST","    5-bis) ricavi non ricorrenti"]
["100830.000001.000302","CE Attività VEN F GAS ST",100830,302,1,"Eliminata","VEN F GAS ST","  VENDITE INTERNE"]
["100830.000302.000304","CE Attività VEN F GAS ST",100830,304,302,"Eliminata","VEN F GAS ST","    Vendita interna di beni e servizi ad altre attività a prezzo di mercato"]
["100830.000302.010968","CE Attività VEN F GAS ST",100830,10968,302,"Eliminata","VEN F GAS ST","    Vendita interna di beni e servizi ad altre attività a costo pieno"]
["100830.000000.000307","CE Attività VEN F GAS ST",100830,307,null,"Eliminata","VEN F GAS ST","B.1) COSTI DELLA PRODUZIONE COMPRENSIVI DEGLI ACQUISTI INTERNI"]
["100830.000307.000308","CE Attività VEN F GAS ST",100830,308,307,"Eliminata","VEN F GAS ST","  B) COSTI DELLA PRODUZIONE"]
["100830.000308.000309","CE Attività VEN F GAS ST",100830,309,308,"Eliminata","VEN F GAS ST","    6) Per materie prime, sussidiarie, di consumo e di merci (a livello di attività vanno riportati i consumi)"]
["100830.000309.002007","CE Attività VEN F GAS ST",100830,2007,309,"Eliminata","VEN F GAS ST","Per acquisto e trasporto dell'energia"]
["100830.000309.002008","CE Attività VEN F GAS ST",100830,2008,309,"Eliminata","VEN F GAS ST","Altri costi di materie prime, sussidiarie, di consumo e di merci"]
["100830.000308.000416","CE Attività VEN F GAS ST",100830,416,308,"Eliminata","VEN F GAS ST","    7) Per servizi"]
["100830.000416.002003","CE Attività VEN F GAS ST",100830,2003,416,"Eliminata","VEN F GAS ST","     Per servizi"]
["100830.000308.000511","CE Attività VEN F GAS ST",100830,511,308,"Eliminata","VEN F GAS ST","    8) Per godimento beni di terzi"]
["100830.000511.002004","CE Attività VEN F GAS ST",100830,2004,511,"Eliminata","VEN F GAS ST","          Per godimento beni di terzi"]
["100830.000308.000532","CE Attività VEN F GAS ST",100830,532,308,"Eliminata","VEN F GAS ST","    9) Per il personale "]
["100830.000532.002005","CE Attività VEN F GAS ST",100830,2005,532,"Eliminata","VEN F GAS ST","    Per il personale "]
["100830.000308.000544","CE Attività VEN F GAS ST",100830,544,308,"Eliminata","VEN F GAS ST","    10) Ammortamenti e svalutazioni"]
["100830.000544.000545","CE Attività VEN F GAS ST",100830,545,544,"Eliminata","VEN F GAS ST","       Ammortamento delle immobilizzazioni immateriali"]
["100830.000544.000547","CE Attività VEN F GAS ST",100830,547,544,"Eliminata","VEN F GAS ST","       Ammortamento delle immobilizzazioni materiali (ammortamento tecnicoeconomico)"]
["100830.000544.000548","CE Attività VEN F GAS ST",100830,548,544,"Eliminata","VEN F GAS ST","       Ammortamento delle immobilizzazioni materiali (ammortamento finanziario)"]
["100830.000544.000549","CE Attività VEN F GAS ST",100830,549,544,{"$f":"IF(TRIM(H963)=TRIM(I963),\"Invariata\",IF(H963=\"\",\"Aggiunta\",IF(I963=\"\",\"Eliminata\",\"Modificata\")))","v":"Eliminata"},"VEN F GAS ST","       Altre svalutazioni delle immobilizzazioni"]
["100830.000544.000550","CE Attività VEN F GAS ST",100830,550,544,"Eliminata","VEN F GAS ST","       Svalutazione dei crediti compresi nell'attivo circolante e delle disponibilità"]
["100830.000308.000554","CE Attività VEN F GAS ST",100830,554,308,"Eliminata","VEN F GAS ST","    12) Accantonamenti per rischi"]
["100830.000554.001135","CE Attività VEN F GAS ST",100830,1135,554,"Eliminata","VEN F GAS ST","          - accantonamenti per rischi "]
["100830.000308.000558","CE Attività VEN F GAS ST",100830,558,308,"Eliminata","VEN F GAS ST","    13) Altri accantonamenti"]
["100830.000558.000559","CE Attività VEN F GAS ST",100830,559,558,"Eliminata","VEN F GAS ST","       Altri accantonamenti"]
["100830.000308.000560","CE Attività VEN F GAS ST",100830,560,308,"Eliminata","VEN F GAS ST","    14) Oneri diversi di gestione"]
["100830.000560.002006","CE Attività VEN F GAS ST",100830,2006,560,"Eliminata","VEN F GAS ST","   Oneri diversi di gestione"]
["100830.000308.012515","CE Attività VEN F GAS ST",100830,12515,308,"Eliminata","VEN F GAS ST","    14-bis ) oneri non ricorrenti"]
["100830.000307.000574","CE Attività VEN F GAS ST",100830,574,307,"Eliminata","VEN F GAS ST","  ACQUISTI INTERNI"]
["100830.000574.010916","CE Attività VEN F GAS ST",100830,10916,574,"Eliminata","VEN F GAS ST","       Acquisto interno di beni e servizi da altre attività a prezzo di mercato"]
["100830.000000.001142","CE Attività VEN F GAS ST",100830,1142,null,"Eliminata","VEN F GAS ST","DIFFERENZA TRA VALORE E COSTI DELLA PRODUZIONE"]
["100830.000000.000603","CE Attività VEN F GAS ST",100830,603,null,"Eliminata","VEN F GAS ST","   COSTI INDIRETTI"]
["100830.000603.000605","CE Attività VEN F GAS ST",100830,605,603,"Eliminata","VEN F GAS ST","       Costi attribuiti dalle funzioni operative condivise"]
["100830.000605.000608","CE Attività VEN F GAS ST",100830,608,605,"Eliminata","VEN F GAS ST","       Funzione operativa condivisa di misura tra attività di settori diversi o tra attività diverse del settore idrico"]
["100830.000605.000610","CE Attività VEN F GAS ST",100830,610,605,"Eliminata","VEN F GAS ST","          Funzione operativa condivisa di cartografia elettronica"]
["100830.000605.010937","CE Attività VEN F GAS ST",100830,10937,605,"Eliminata","VEN F GAS ST","       Funzione operativa condivisa commerciale, di vendita e gestione clientela del settore elettrico"]
["100830.000605.010938","CE Attività VEN F GAS ST",100830,10938,605,"Eliminata","VEN F GAS ST","       Funzione operativa condivisa commerciale, di vendita e gestione clientela del settore gas"]
["100830.000605.010939","CE Attività VEN F GAS ST",100830,10939,605,"Eliminata","VEN F GAS ST","       Funzione operativa condivisa commerciale, di vendita e gestione clientela comune al settore elettrico e gas"]
["100830.000605.010940","CE Attività VEN F GAS ST",100830,10940,605,"Eliminata","VEN F GAS ST","       Funzione operativa condivisa di acquisto di energia elettrica"]
["100830.000605.010941","CE Attività VEN F GAS ST",100830,10941,605,"Eliminata","VEN F GAS ST","       Funzione operativa condivisa di acquisto di gas"]
["100830.000605.010942","CE Attività VEN F GAS ST",100830,10942,605,"Eliminata","VEN F GAS ST","       Funzione operativa condivisa di acquisto comune di energia elettrica e di gas"]
["100830.000605.011512","CE Attività VEN F GAS ST",100830,11512,605,"Eliminata","VEN F GAS ST","       Funzione operativa condivisa di verifica e controllo"]
["100830.000605.011517","CE Attività VEN F GAS ST",100830,11517,605,"Eliminata","VEN F GAS ST","       Funzione operativa condivisa di telecontrollo e ricerca perdite"]
["100830.000605.011521","CE Attività VEN F GAS ST",100830,11521,605,"Eliminata","VEN F GAS ST","       Funzione operativa condivisa di manutenzione e servizi tecnici"]
["100830.000603.000612","CE Attività VEN F GAS ST",100830,612,603,"Eliminata","VEN F GAS ST","       Costi attribuiti dai servizi comuni"]
["100830.000612.002010","CE Attività VEN F GAS ST",100830,2010,612,"Eliminata","VEN F GAS ST","          Costi attribuiti dai servizi comuni"]
["100830.000603.010957","CE Attività VEN F GAS ST",100830,10957,603,"Eliminata","VEN F GAS ST","       Acquisto interno di beni e servizi da altre attività a costo pieno"]
["100830.000000.001143","CE Attività VEN F GAS ST",100830,1143,null,"Eliminata","VEN F GAS ST","COSTI DELLA PRODUZIONE (DIRETTI + INDIRETTI)"]
["100830.000000.002009","CE Attività VEN F GAS ST",100830,2009,null,"Eliminata","VEN F GAS ST","DIFFERENZA TRA VALORE E COSTI DELLA PRODUZIONE DOPO TRANSAZIONI INTERNE"]
["100830.000000.001144","CE Attività VEN F GAS ST",100830,1144,null,"Eliminata","VEN F GAS ST","DIFFERENZA TRA VALORE E COSTI DELLA PRODUZIONE DOPO TRANSAZIONI INTERNE E ATTRIBUZIONE DEI VALORI RELATIVI ALLE FUNZIONI OPERATIVE CONDIVISE E AI SERVIZI COMUNI"]
["100836.000000.000001","CE Attività VEN F GAS ML",100836,1,null,"Invariata","VEN F GAS ML","  A.1) VALORE DELLA PRODUZIONE COMPRENSIVO DELLE VENDITE INTERNE","  A.1) VALORE DELLA PRODUZIONE COMPRENSIVO DELLE VENDITE INTERNE","  A.1) VALORE DELLA PRODUZIONE COMPRENSIVO DELLE VENDITE INTERNE"]
["100836.000001.000002","CE Attività VEN F GAS ML",100836,2,1,"Invariata","VEN F GAS ML","  A) VALORE DELLA PRODUZIONE","  A) VALORE DELLA PRODUZIONE","  A) VALORE DELLA PRODUZIONE"]
[{"$f":"CONCATENATE(TEXT(C996,\"000000\"),\".\",TEXT(E996,\"000000\"),\".\",TEXT(D996,\"000000\"))","v":"100836.000002.000003"},"CE Attività VEN F GAS ML",100836,3,2,"Invariata","VEN F GAS ML","    1) Ricavi delle vendite e delle prestazioni","    1) Ricavi delle vendite e delle prestazioni","    1) Ricavi delle vendite e delle prestazioni"]
["100836.000003.001149","CE Attività VEN F GAS ML",100836,1149,3,"Invariata","VEN F GAS ML"," Ricavi dalle vendite e dalle prestazioni"," Ricavi dalle vendite e dalle prestazioni"," Ricavi dalle vendite e dalle prestazioni"]
["100836.000002.000253","CE Attività VEN F GAS ML",100836,253,2,"Invariata","VEN F GAS ML","    2) Variazioni delle rimanenze di prodotti in corso di lavorazione, semilavorati e finiti","    2) Variazioni delle rimanenze di prodotti in corso di lavorazione, semilavorati e finiti","    2) Variazioni delle rimanenze di prodotti in corso di lavorazione, semilavorati e finiti"]
["100836.000253.000254","CE Attività VEN F GAS ML",100836,254,253,"Invariata","VEN F GAS ML","       Variazioni delle rimanenze di prodotti in corso di lavorazione, semilavorati e finiti","       Variazioni delle rimanenze di prodotti in corso di lavorazione, semilavorati e finiti","       Variazioni delle rimanenze di prodotti in corso di lavorazione, semilavorati e finiti"]
["100836.000002.000255","CE Attività VEN F GAS ML",100836,255,2,"Invariata","VEN F GAS ML","    3) Variazioni dei lavori in corso su ordinazioni","    3) Variazioni dei lavori in corso su ordinazioni","    3) Variazioni dei lavori in corso su ordinazioni"]
["100836.000255.000256","CE Attività VEN F GAS ML",100836,256,255,"Invariata","VEN F GAS ML","       Variazioni dei lavori in corso su ordinazione","       Variazioni dei lavori in corso su ordinazione","       Variazioni dei lavori in corso su ordinazione"]
["100836.000002.000257","CE Attività VEN F GAS ML",100836,257,2,"Invariata","VEN F GAS ML","    4) Incrementi di immobilizzazioni per lavori interni ","    4) Incrementi di immobilizzazioni per lavori interni ","    4) Incrementi di immobilizzazioni per lavori interni "]
["100836.000257.002001","CE Attività VEN F GAS ML",100836,2001,257,"Invariata","VEN F GAS ML","  Incrementi di immobilizzazioni per lavori interni ","  Incrementi di immobilizzazioni per lavori interni ","  Incrementi di immobilizzazioni per lavori interni "]
["100836.000002.011466","CE Attività VEN F GAS ML",100836,11466,2,"Invariata","VEN F GAS ML","    5) Altri ricavi e proventi, con separata indicazione dei contributi in conto esercizio","    5) Altri ricavi e proventi, con separata indicazione dei contributi in conto esercizio","    5) Altri ricavi e proventi, con separata indicazione dei contributi in conto esercizio"]
["100836.011466.011457","CE Attività VEN F GAS ML",100836,11457,11466,"Invariata","VEN F GAS ML","   Altri ricavi e proventi","   Altri ricavi e proventi","   Altri ricavi e proventi"]
["100836.000002.012514","CE Attività VEN F GAS ML",100836,12514,2,"Invariata","VEN F GAS ML","    5-bis) ricavi non ricorrenti","    5-bis) ricavi non ricorrenti","    5-bis) ricavi non ricorrenti"]
["100836.000001.000302","CE Attività VEN F GAS ML",100836,302,1,"Invariata","VEN F GAS ML","  VENDITE INTERNE","  VENDITE INTERNE","  VENDITE INTERNE"]
["100836.000302.000304","CE Attività VEN F GAS ML",100836,304,302,"Invariata","VEN F GAS ML","    Vendita interna di beni e servizi ad altre attività a prezzo di mercato","    Vendita interna di beni e servizi ad altre attività a prezzo di mercato","    Vendita interna di beni e servizi ad altre attività a prezzo di mercato"]
["100836.000302.010968","CE Attività VEN F GAS ML",100836,10968,302,"Invariata","VEN F GAS ML","    Vendita interna di beni e servizi ad altre attività a costo pieno","    Vendita interna di beni e servizi ad altre attività a costo pieno","    Vendita interna di beni e servizi ad altre attività a costo pieno"]
["100836.000000.000307","CE Attività VEN F GAS ML",100836,307,null,"Invariata","VEN F GAS ML","B.1) COSTI DELLA PRODUZIONE COMPRENSIVI DEGLI ACQUISTI INTERNI","B.1) COSTI DELLA PRODUZIONE COMPRENSIVI DEGLI ACQUISTI INTERNI","B.1) COSTI DELLA PRODUZIONE COMPRENSIVI DEGLI ACQUISTI INTERNI"]
["100836.000307.000308","CE Attività VEN F GAS ML",100836,308,307,"Invariata","VEN F GAS ML","  B) COSTI DELLA PRODUZIONE","  B) COSTI DELLA PRODUZIONE","  B) COSTI DELLA PRODUZIONE"]
["100836.000308.000309","CE Attività VEN F GAS ML",100836,309,308,"Invariata","VEN F GAS ML","    6) Per materie prime, sussidiarie, di consumo e di merci (a livello di attività vanno riportati i consumi)","    6) Per materie prime, sussidiarie, di consumo e di merci (a livello di attività vanno riportati i consumi)","    6) Per materie prime, sussidiarie, di consumo e di merci (a livello di attività vanno riportati i consumi)"]
["100836.000309.002007","CE Attività VEN F GAS ML",100836,2007,309,"Invariata","VEN F GAS ML","Per acquisto e trasporto dell'energia","Per acquisto e trasporto dell'energia","Per acquisto e trasporto dell'energia"]
["100836.000309.002008","CE Attività VEN F GAS ML",100836,2008,309,"Invariata","VEN F GAS ML","Altri costi di materie prime, sussidiarie, di consumo e di merci","Altri costi di materie prime, sussidiarie, di consumo e di merci","Altri costi di materie prime, sussidiarie, di consumo e di merci"]
["100836.000308.000416","CE Attività VEN F GAS ML",100836,416,308,"Invariata","VEN F GAS ML","    7) Per servizi","    7) Per servizi","    7) Per servizi"]
["100836.000416.002003","CE Attività VEN F GAS ML",100836,2003,416,"Invariata","VEN F GAS ML","     Per servizi","     Per servizi","     Per servizi"]
["100836.000308.000511","CE Attività VEN F GAS ML",100836,511,308,"Invariata","VEN F GAS ML","    8) Per godimento beni di terzi","    8) Per godimento beni di terzi","    8) Per godimento beni di terzi"]
["100836.000511.002004","CE Attività VEN F GAS ML",100836,2004,511,"Invariata","VEN F GAS ML","          Per godimento beni di terzi","          Per godimento beni di terzi","          Per godimento beni di terzi"]
["100836.000308.000532","CE Attività VEN F GAS ML",100836,532,308,"Invariata","VEN F GAS ML","    9) Per il personale ","    9) Per il personale ","    9) Per il personale "]
["100836.000532.002005","CE Attività VEN F GAS ML",100836,2005,532,"Invariata","VEN F GAS ML","    Per il personale ","    Per il personale ","    Per il personale "]
["100836.000308.000544","CE Attività VEN F GAS ML",100836,544,308,"Invariata","VEN F GAS ML","    10) Ammortamenti e svalutazioni","    10) Ammortamenti e svalutazioni","    10) Ammortamenti e svalutazioni"]
["100836.000544.000545","CE Attività VEN F GAS ML",100836,545,544,"Invariata","VEN F GAS ML","       Ammortamento delle immobilizzazioni immateriali","       Ammortamento delle immobilizzazioni immateriali","       Ammortamento delle immobilizzazioni immateriali"]
["100836.000544.000547","CE Attività VEN F GAS ML",100836,547,544,"Invariata","VEN F GAS ML","       Ammortamento delle immobilizzazioni materiali (ammortamento tecnicoeconomico)","       Ammortamento delle immobilizzazioni materiali (ammortamento tecnicoeconomico)","       Ammortamento delle immobilizzazioni materiali (ammortamento tecnicoeconomico)"]
["100836.000544.000548","CE Attività VEN F GAS ML",100836,548,544,"Invariata","VEN F GAS ML","       Ammortamento delle immobilizzazioni materiali (ammortamento finanziario)","       Ammortamento delle immobilizzazioni materiali (ammortamento finanziario)","       Ammortamento delle immobilizzazioni materiali (ammortamento finanziario)"]
["100836.000544.000549","CE Attività VEN F GAS ML",100836,549,544,"Invariata","VEN F GAS ML","       Altre svalutazioni delle immobilizzazioni","       Altre svalutazioni delle immobilizzazioni","       Altre svalutazioni delle immobilizzazioni"]
["100836.000544.000550","CE Attività VEN F GAS ML",100836,550,544,"Invariata","VEN F GAS ML","       Svalutazione dei crediti compresi nell'attivo circolante e delle disponibilità","       Svalutazione dei crediti compresi nell'attivo circolante e delle disponibilità","       Svalutazione dei crediti compresi nell'attivo circolante e delle disponibilità"]
["100836.000308.000554","CE Attività VEN F GAS ML",100836,554,308,{"$f":"IF(TRIM(H1027)=TRIM(I1027),\"Invariata\",IF(H1027=\"\",\"Aggiunta\",IF(I1027=\"\",\"Eliminata\",\"Modificata\")))","v":"Invariata"},"VEN F GAS ML","    12) Accantonamenti per rischi","    12) Accantonamenti per rischi","    12) Accantonamenti per rischi"]
["100836.000554.001135","CE Attività VEN F GAS ML",100836,1135,554,"Invariata","VEN F GAS ML","          - accantonamenti per rischi ","          - accantonamenti per rischi ","          - accantonamenti per rischi "]
["100836.000308.000558","CE Attività VEN F GAS ML",100836,558,308,"Invariata","VEN F GAS ML","    13) Altri accantonamenti","    13) Altri accantonamenti","    13) Altri accantonamenti"]
["100836.000558.000559","CE Attività VEN F GAS ML",100836,559,558,"Invariata","VEN F GAS ML","       Altri accantonamenti","       Altri accantonamenti","       Altri accantonamenti"]
["100836.000308.000560","CE Attività VEN F GAS ML",100836,560,308,"Invariata","VEN F GAS ML","    14) Oneri diversi di gestione","    14) Oneri diversi di gestione","    14) Oneri diversi di gestione"]
["100836.000560.002006","CE Attività VEN F GAS ML",100836,2006,560,"Invariata","VEN F GAS ML","   Oneri diversi di gestione","   Oneri diversi di gestione","   Oneri diversi di gestione"]
["100836.000308.012515","CE Attività VEN F GAS ML",100836,12515,308,"Invariata","VEN F GAS ML","    14-bis ) oneri non ricorrenti","    14-bis ) oneri non ricorrenti","    14-bis ) oneri non ricorrenti"]
["100836.000307.000574","CE Attività VEN F GAS ML",100836,574,307,"Invariata","VEN F GAS ML","  ACQUISTI INTERNI","  ACQUISTI INTERNI","  ACQUISTI INTERNI"]
["100836.000574.010916","CE Attività VEN F GAS ML",100836,10916,574,"Invariata","VEN F GAS ML","       Acquisto interno di beni e servizi da altre attività a prezzo di mercato","       Acquisto interno di beni e servizi da altre attività a prezzo di mercato","       Acquisto interno di beni e servizi da altre attività a prezzo di mercato"]
["100836.000000.001142","CE Attività VEN F GAS ML",100836,1142,null,"Invariata","VEN F GAS ML","DIFFERENZA TRA VALORE E COSTI DELLA PRODUZIONE","DIFFERENZA TRA VALORE E COSTI DELLA PRODUZIONE","DIFFERENZA TRA VALORE E COSTI DELLA PRODUZIONE"]
["100836.000000.000603","CE Attività VEN F GAS ML",100836,603,null,"Invariata","VEN F GAS ML","   COSTI INDIRETTI","   COSTI INDIRETTI","   COSTI INDIRETTI"]
["100836.000603.000605","CE Attività VEN F GAS ML",100836,605,603,"Invariata","VEN F GAS ML","       Costi attribuiti dalle funzioni operative condivise","       Costi attribuiti dalle funzioni operative condivise","       Costi attribuiti dalle funzioni operative condivise"]
["100836.000605.000608","CE Attività VEN F GAS ML",100836,608,605,"Invariata","VEN F GAS ML","       Funzione operativa condivisa di misura tra attività di settori diversi o tra attività diverse del settore idrico","       Funzione operativa condivisa di misura tra attività di settori diversi o tra attività diverse del settore idrico","       Funzione operativa condivisa di misura tra attività di settori diversi o tra attività diverse del settore idrico"]
["100836.000605.000610","CE Attività VEN F GAS ML",100836,610,605,"Invariata","VEN F GAS ML","          Funzione operativa condivisa di cartografia elettronica","          Funzione operativa condivisa di cartografia elettronica","          Funzione operativa condivisa di cartografia elettronica"]
["100836.000605.010937","CE Attività VEN F GAS ML",100836,10937,605,"Invariata","VEN F GAS ML","       Funzione operativa condivisa commerciale, di vendita e gestione clientela del settore elettrico","       Funzione operativa condivisa commerciale, di vendita e gestione clientela del settore elettrico","       Funzione operativa condivisa commerciale, di vendita e gestione clientela del settore elettrico"]
["100836.000605.010938","CE Attività VEN F GAS ML",100836,10938,605,"Invariata","VEN F GAS ML","       Funzione operativa condivisa commerciale, di vendita e gestione clientela del settore gas","       Funzione operativa condivisa commerciale, di vendita e gestione clientela del settore gas","       Funzione operativa condivisa commerciale, di vendita e gestione clientela del settore gas"]
["100836.000605.010939","CE Attività VEN F GAS ML",100836,10939,605,"Invariata","VEN F GAS ML","       Funzione operativa condivisa commerciale, di vendita e gestione clientela comune al settore elettrico e gas","       Funzione operativa condivisa commerciale, di vendita e gestione clientela comune al settore elettrico e gas","       Funzione operativa condivisa commerciale, di vendita e gestione clientela comune al settore elettrico e gas"]
["100836.000605.010940","CE Attività VEN F GAS ML",100836,10940,605,"Invariata","VEN F GAS ML","       Funzione operativa condivisa di acquisto di energia elettrica","       Funzione operativa condivisa di acquisto di energia elettrica","       Funzione operativa condivisa di acquisto di energia elettrica"]
["100836.000605.010941","CE Attività VEN F GAS ML",100836,10941,605,"Invariata","VEN F GAS ML","       Funzione operativa condivisa di acquisto di gas","       Funzione operativa condivisa di acquisto di gas","       Funzione operativa condivisa di acquisto di gas"]
["100836.000605.010942","CE Attività VEN F GAS ML",100836,10942,605,"Invariata","VEN F GAS ML","       Funzione operativa condivisa di acquisto comune di energia elettrica e di gas","       Funzione operativa condivisa di acquisto comune di energia elettrica e di gas","       Funzione operativa condivisa di acquisto comune di energia elettrica e di gas"]
["100836.000605.011512","CE Attività VEN F GAS ML",100836,11512,605,"Invariata","VEN F GAS ML","       Funzione operativa condivisa di verifica e controllo","       Funzione operativa condivisa di verifica e controllo","       Funzione operativa condivisa di verifica e controllo"]
["100836.000605.011517","CE Attività VEN F GAS ML",100836,11517,605,"Invariata","VEN F GAS ML","       Funzione operativa condivisa di telecontrollo e ricerca perdite","       Funzione operativa condivisa di telecontrollo e ricerca perdite","       Funzione operativa condivisa di telecontrollo e ricerca perdite"]
["100836.000605.011521","CE Attività VEN F GAS ML",100836,11521,605,"Invariata","VEN F GAS ML","       Funzione operativa condivisa di manutenzione e servizi tecnici","       Funzione operativa condivisa di manutenzione e servizi tecnici","       Funzione operativa condivisa di manutenzione e servizi tecnici"]
["100836.000603.000612","CE Attività VEN F GAS ML",100836,612,603,"Invariata","VEN F GAS ML","       Costi attribuiti dai servizi comuni","       Costi attribuiti dai servizi comuni","       Costi attribuiti dai servizi comuni"]
["100836.000612.002010","CE Attività VEN F GAS ML",100836,2010,612,"Invariata","VEN F GAS ML","          Costi attribuiti dai servizi comuni","          Costi attribuiti dai servizi comuni","          Costi attribuiti dai servizi comuni"]
["100836.000603.010957","CE Attività VEN F GAS ML",100836,10957,603,"Invariata","VEN F GAS ML","       Acquisto interno di beni e servizi da altre attività a costo pieno","       Acquisto interno di beni e servizi da altre attività a costo pieno","       Acquisto interno di beni e servizi da altre attività a costo pieno"]
["100836.000000.001143","CE Attività VEN F GAS ML",100836,1143,null,"Invariata","VEN F GAS ML","COSTI DELLA PRODUZIONE (DIRETTI + INDIRETTI)","COSTI DELLA PRODUZIONE (DIRETTI + INDIRETTI)","COSTI DELLA PRODUZIONE (DIRETTI + INDIRETTI)"]
["100836.000000.002009","CE Attività VEN F GAS ML",100836,2009,null,"Invariata","VEN F GAS ML","DIFFERENZA TRA VALORE E COSTI DELLA PRODUZIONE DOPO TRANSAZIONI INTERNE","DIFFERENZA TRA VALORE E COSTI DELLA PRODUZIONE DOPO TRANSAZIONI INTERNE","DIFFERENZA TRA VALORE E COSTI DELLA PRODUZIONE DOPO TRANSAZIONI INTERNE"]
["100836.000000.001144","CE Attività VEN F GAS ML",100836,1144,null,"Invariata","VEN F GAS ML","DIFFERENZA TRA VALORE E COSTI DELLA PRODUZIONE DOPO TRANSAZIONI INTERNE E ATTRIBUZIONE DEI VALORI RELATIVI ALLE FUNZIONI OPERATIVE CONDIVISE E AI SERVIZI COMUNI","DIFFERENZA TRA VALORE E COSTI DELLA PRODUZIONE DOPO TRANSAZIONI INTERNE E ATTRIBUZIONE DEI VALORI RELATIVI ALLE FUNZIONI OPERATIVE CONDIVISE E AI SERVIZI COMUNI","DIFFERENZA TRA VALORE E COSTI DELLA PRODUZIONE DOPO TRANSAZIONI INTERNE E ATTRIBUZIONE DEI VALORI RELATIVI ALLE FUNZIONI OPERATIVE CONDIVISE E AI SERVIZI COMUNI"]
["100711.000000.000001","CE Attività DIST GAS DIV",100711,1,null,"Invariata","DIST GAS DIV","  A.1) VALORE DELLA PRODUZIONE COMPRENSIVO DELLE VENDITE INTERNE","  A.1) VALORE DELLA PRODUZIONE COMPRENSIVO DELLE VENDITE INTERNE","  A.1) VALORE DELLA PRODUZIONE COMPRENSIVO DELLE VENDITE INTERNE"]
["100711.000001.000002","CE Attività DIST GAS DIV",100711,2,1,"Invariata","DIST GAS DIV","  A) VALORE DELLA PRODUZIONE","  A) VALORE DELLA PRODUZIONE","  A) VALORE DELLA PRODUZIONE"]
["100711.000002.000003","CE Attività DIST GAS DIV",100711,3,2,"Invariata","DIST GAS DIV","    1) Ricavi delle vendite e delle prestazioni","    1) Ricavi delle vendite e delle prestazioni","    1) Ricavi delle vendite e delle prestazioni"]
["100711.000003.001149","CE Attività DIST GAS DIV",100711,1149,3,"Invariata","DIST GAS DIV"," Ricavi dalle vendite e dalle prestazioni"," Ricavi dalle vendite e dalle prestazioni"," Ricavi dalle vendite e dalle prestazioni"]
[{"$f":"CONCATENATE(TEXT(C1060,\"000000\"),\".\",TEXT(E1060,\"000000\"),\".\",TEXT(D1060,\"000000\"))","v":"100711.000002.000253"},"CE Attività DIST GAS DIV",100711,253,2,"Invariata","DIST GAS DIV","    2) Variazioni delle rimanenze di prodotti in corso di lavorazione, semilavorati e finiti","    2) Variazioni delle rimanenze di prodotti in corso di lavorazione, semilavorati e finiti","    2) Variazioni delle rimanenze di prodotti in corso di lavorazione, semilavorati e finiti"]
["100711.000253.000254","CE Attività DIST GAS DIV",100711,254,253,"Invariata","DIST GAS DIV","       Variazioni delle rimanenze di prodotti in corso di lavorazione, semilavorati e finiti","       Variazioni delle rimanenze di prodotti in corso di lavorazione, semilavorati e finiti","       Variazioni delle rimanenze di prodotti in corso di lavorazione, semilavorati e finiti"]
["100711.000002.000255","CE Attività DIST GAS DIV",100711,255,2,"Invariata","DIST GAS DIV","    3) Variazioni dei lavori in corso su ordinazioni","    3) Variazioni dei lavori in corso su ordinazioni","    3) Variazioni dei lavori in corso su ordinazioni"]
["100711.000255.000256","CE Attività DIST GAS DIV",100711,256,255,"Invariata","DIST GAS DIV","       Variazioni dei lavori in corso su ordinazione","       Variazioni dei lavori in corso su ordinazione","       Variazioni dei lavori in corso su ordinazione"]
["100711.000002.000257","CE Attività DIST GAS DIV",100711,257,2,"Invariata","DIST GAS DIV","    4) Incrementi di immobilizzazioni per lavori interni ","    4) Incrementi di immobilizzazioni per lavori interni ","    4) Incrementi di immobilizzazioni per lavori interni "]
["100711.000257.002001","CE Attività DIST GAS DIV",100711,2001,257,"Invariata","DIST GAS DIV","  Incrementi di immobilizzazioni per lavori interni ","  Incrementi di immobilizzazioni per lavori interni ","  Incrementi di immobilizzazioni per lavori interni "]
["100711.000002.011466","CE Attività DIST GAS DIV",100711,11466,2,"Invariata","DIST GAS DIV","    5) Altri ricavi e proventi, con separata indicazione dei contributi in conto esercizio","    5) Altri ricavi e proventi, con separata indicazione dei contributi in conto esercizio","    5) Altri ricavi e proventi, con separata indicazione dei contributi in conto esercizio"]
["100711.011466.011457","CE Attività DIST GAS DIV",100711,11457,11466,"Invariata","DIST GAS DIV","   Altri ricavi e proventi","   Altri ricavi e proventi","   Altri ricavi e proventi"]
["100711.000002.012514","CE Attività DIST GAS DIV",100711,12514,2,"Invariata","DIST GAS DIV","    5-bis) ricavi non ricorrenti","    5-bis) ricavi non ricorrenti","    5-bis) ricavi non ricorrenti"]
["100711.000001.000302","CE Attività DIST GAS DIV",100711,302,1,"Invariata","DIST GAS DIV","  VENDITE INTERNE","  VENDITE INTERNE","  VENDITE INTERNE"]
["100711.000302.000304","CE Attività DIST GAS DIV",100711,304,302,"Invariata","DIST GAS DIV","    Vendita interna di beni e servizi ad altre attività a prezzo di mercato","    Vendita interna di beni e servizi ad altre attività a prezzo di mercato","    Vendita interna di beni e servizi ad altre attività a prezzo di mercato"]
["100711.000302.010968","CE Attività DIST GAS DIV",100711,10968,302,"Invariata","DIST GAS DIV","    Vendita interna di beni e servizi ad altre attività a costo pieno","    Vendita interna di beni e servizi ad altre attività a costo pieno","    Vendita interna di beni e servizi ad altre attività a costo pieno"]
["100711.000000.000307","CE Attività DIST GAS DIV",100711,307,null,"Invariata","DIST GAS DIV","B.1) COSTI DELLA PRODUZIONE COMPRENSIVI DEGLI ACQUISTI INTERNI","B.1) COSTI DELLA PRODUZIONE COMPRENSIVI DEGLI ACQUISTI INTERNI","B.1) COSTI DELLA PRODUZIONE COMPRENSIVI DEGLI ACQUISTI INTERNI"]
["100711.000307.000308","CE Attività DIST GAS DIV",100711,308,307,"Invariata","DIST GAS DIV","  B) COSTI DELLA PRODUZIONE","  B) COSTI DELLA PRODUZIONE","  B) COSTI DELLA PRODUZIONE"]
["100711.000308.000309","CE Attività DIST GAS DIV",100711,309,308,"Invariata","DIST GAS DIV","    6) Per materie prime, sussidiarie, di consumo e di merci (a livello di attività vanno riportati i consumi)","    6) Per materie prime, sussidiarie, di consumo e di merci (a livello di attività vanno riportati i consumi)","    6) Per materie prime, sussidiarie, di consumo e di merci (a livello di attività vanno riportati i consumi)"]
["100711.000309.002007","CE Attività DIST GAS DIV",100711,2007,309,"Invariata","DIST GAS DIV","Per acquisto e trasporto dell'energia","Per acquisto e trasporto dell'energia","Per acquisto e trasporto dell'energia"]
["100711.000309.002008","CE Attività DIST GAS DIV",100711,2008,309,"Invariata","DIST GAS DIV","Altri costi di materie prime, sussidiarie, di consumo e di merci","Altri costi di materie prime, sussidiarie, di consumo e di merci","Altri costi di materie prime, sussidiarie, di consumo e di merci"]
["100711.000308.000416","CE Attività DIST GAS DIV",100711,416,308,"Invariata","DIST GAS DIV","    7) Per servizi","    7) Per servizi","    7) Per servizi"]
["100711.000416.002003","CE Attività DIST GAS DIV",100711,2003,416,"Invariata","DIST GAS DIV","     Per servizi","     Per servizi","     Per servizi"]
["100711.000308.000511","CE Attività DIST GAS DIV",100711,511,308,"Invariata","DIST GAS DIV","    8) Per godimento beni di terzi","    8) Per godimento beni di terzi","    8) Per godimento beni di terzi"]
["100711.000511.002004","CE Attività DIST GAS DIV",100711,2004,511,"Invariata","DIST GAS DIV","          Per godimento beni di terzi","          Per godimento beni di terzi","          Per godimento beni di terzi"]
["100711.000308.000532","CE Attività DIST GAS DIV",100711,532,308,"Invariata","DIST GAS DIV","    9) Per il personale ","    9) Per il personale ","    9) Per il personale "]
["100711.000532.002005","CE Attività DIST GAS DIV",100711,2005,532,"Invariata","DIST GAS DIV","    Per il personale ","    Per il personale ","    Per il personale "]
["100711.000308.000544","CE Attività DIST GAS DIV",100711,544,308,"Invariata","DIST GAS DIV","    10) Ammortamenti e svalutazioni","    10) Ammortamenti e svalutazioni","    10) Ammortamenti e svalutazioni"]
["100711.000544.000545","CE Attività DIST GAS DIV",100711,545,544,"Invariata","DIST GAS DIV","       Ammortamento delle immobilizzazioni immateriali","       Ammortamento delle immobilizzazioni immateriali","       Ammortamento delle immobilizzazioni immateriali"]
["100711.000544.000547","CE Attività DIST GAS DIV",100711,547,544,"Invariata","DIST GAS DIV","       Ammortamento delle immobilizzazioni materiali (ammortamento tecnicoeconomico)","       Ammortamento delle immobilizzazioni materiali (ammortamento tecnicoeconomico)","       Ammortamento delle immobilizzazioni materiali (ammortamento tecnicoeconomico)"]
["100711.000544.000548","CE Attività DIST GAS DIV",100711,548,544,"Invariata","DIST GAS DIV","       Ammortamento delle immobilizzazioni materiali (ammortamento finanziario)","       Ammortamento delle immobilizzazioni materiali (ammortamento finanziario)","       Ammortamento delle immobilizzazioni materiali (ammortamento finanziario)"]
["100711.000544.000549","CE Attività DIST GAS DIV",100711,549,544,"Invariata","DIST GAS DIV","       Altre svalutazioni delle immobilizzazioni","       Altre svalutazioni delle immobilizzazioni","       Altre svalutazioni delle immobilizzazioni"]
["100711.000544.000550","CE Attività DIST GAS DIV",100711,550,544,"Invariata","DIST GAS DIV","       Svalutazione dei crediti compresi nell'attivo circolante e delle disponibilità","       Svalutazione dei crediti compresi nell'attivo circolante e delle disponibilità","       Svalutazione dei crediti compresi nell'attivo circolante e delle disponibilità"]
["100711.000308.000554","CE Attività DIST GAS DIV",100711,554,308,"Invariata","DIST GAS DIV","    12) Accantonamenti per rischi","    12) Accantonamenti per rischi","    12) Accantonamenti per rischi"]
["100711.000554.001135","CE Attività DIST GAS DIV",100711,1135,554,"Invariata","DIST GAS DIV","          - accantonamenti per rischi ","          - accantonamenti per rischi ","          - accantonamenti per rischi "]
["100711.000308.000558","CE Attività DIST GAS DIV",100711,558,308,{"$f":"IF(TRIM(H1091)=TRIM(I1091),\"Invariata\",IF(H1091=\"\",\"Aggiunta\",IF(I1091=\"\",\"Eliminata\",\"Modificata\")))","v":"Invariata"},"DIST GAS DIV","    13) Altri accantonamenti","    13) Altri accantonamenti","    13) Altri accantonamenti"]
["100711.000558.000559","CE Attività DIST GAS DIV",100711,559,558,"Invariata","DIST GAS DIV","       Altri accantonamenti","       Altri accantonamenti","       Altri accantonamenti"]
["100711.000308.000560","CE Attività DIST GAS DIV",100711,560,308,"Invariata","DIST GAS DIV","    14) Oneri diversi di gestione","    14) Oneri diversi di gestione","    14) Oneri diversi di gestione"]
["100711.000560.002006","CE Attività DIST GAS DIV",100711,2006,560,"Invariata","DIST GAS DIV","   Oneri diversi di gestione","   Oneri diversi di gestione","   Oneri diversi di gestione"]
["100711.000308.012515","CE Attività DIST GAS DIV",100711,12515,308,"Invariata","DIST GAS DIV","    14-bis ) oneri non ricorrenti","    14-bis ) oneri non ricorrenti","    14-bis ) oneri non ricorrenti"]
["100711.000307.000574","CE Attività DIST GAS DIV",100711,574,307,"Invariata","DIST GAS DIV","  ACQUISTI INTERNI","  ACQUISTI INTERNI","  ACQUISTI INTERNI"]
["100711.000574.010916","CE Attività DIST GAS DIV",100711,10916,574,"Invariata","DIST GAS DIV","       Acquisto interno di beni e servizi da altre attività a prezzo di mercato","       Acquisto interno di beni e servizi da altre attività a prezzo di mercato","       Acquisto interno di beni e servizi da altre attività a prezzo di mercato"]
["100711.000000.001142","CE Attività DIST GAS DIV",100711,1142,null,"Invariata","DIST GAS DIV","DIFFERENZA TRA VALORE E COSTI DELLA PRODUZIONE","DIFFERENZA TRA VALORE E COSTI DELLA PRODUZIONE","DIFFERENZA TRA VALORE E COSTI DELLA PRODUZIONE"]
["100711.000000.000603","CE Attività DIST GAS DIV",100711,603,null,"Invariata","DIST GAS DIV","   COSTI INDIRETTI","   COSTI INDIRETTI","   COSTI INDIRETTI"]
["100711.000603.000605","CE Attività DIST GAS DIV",100711,605,603,"Invariata","DIST GAS DIV","       Costi attribuiti dalle funzioni operative condivise","       Costi attribuiti dalle funzioni operative condivise","       Costi attribuiti dalle funzioni operative condivise"]
["100711.000605.000608","CE Attività DIST GAS DIV",100711,608,605,"Invariata","DIST GAS DIV","       Funzione operativa condivisa di misura tra attività di settori diversi o tra attività diverse del settore idrico","       Funzione operativa condivisa di misura tra attività di settori diversi o tra attività diverse del settore idrico","       Funzione operativa condivisa di misura tra attività di settori diversi o tra attività diverse del settore idrico"]
["100711.000605.000610","CE Attività DIST GAS DIV",100711,610,605,"Invariata","DIST GAS DIV","          Funzione operativa condivisa di cartografia elettronica","          Funzione operativa condivisa di cartografia elettronica","          Funzione operativa condivisa di cartografia elettronica"]
["100711.000605.010937","CE Attività DIST GAS DIV",100711,10937,605,"Invariata","DIST GAS DIV","       Funzione operativa condivisa commerciale, di vendita e gestione clientela del settore elettrico","       Funzione operativa condivisa commerciale, di vendita e gestione clientela del settore elettrico","       Funzione operativa condivisa commerciale, di vendita e gestione clientela del settore elettrico"]
["100711.000605.010938","CE Attività DIST GAS DIV",100711,10938,605,"Invariata","DIST GAS DIV","       Funzione operativa condivisa commerciale, di vendita e gestione clientela del settore gas","       Funzione operativa condivisa commerciale, di vendita e gestione clientela del settore gas","       Funzione operativa condivisa commerciale, di vendita e gestione clientela del settore gas"]
["100711.000605.010939","CE Attività DIST GAS DIV",100711,10939,605,"Invariata","DIST GAS DIV","       Funzione operativa condivisa commerciale, di vendita e gestione clientela comune al settore elettrico e gas","       Funzione operativa condivisa commerciale, di vendita e gestione clientela comune al settore elettrico e gas","       Funzione operativa condivisa commerciale, di vendita e gestione clientela comune al settore elettrico e gas"]
["100711.000605.010940","CE Attività DIST GAS DIV",100711,10940,605,"Invariata","DIST GAS DIV","       Funzione operativa condivisa di acquisto di energia elettrica","       Funzione operativa condivisa di acquisto di energia elettrica","       Funzione operativa condivisa di acquisto di energia elettrica"]
["100711.000605.010941","CE Attività DIST GAS DIV",100711,10941,605,"Invariata","DIST GAS DIV","       Funzione operativa condivisa di acquisto di gas","       Funzione operativa condivisa di acquisto di gas","       Funzione operativa condivisa di acquisto di gas"]
["100711.000605.010942","CE Attività DIST GAS DIV",100711,10942,605,"Invariata","DIST GAS DIV","       Funzione operativa condivisa di acquisto comune di energia elettrica e di gas","       Funzione operativa condivisa di acquisto comune di energia elettrica e di gas","       Funzione operativa condivisa di acquisto comune di energia elettrica e di gas"]
["100711.000605.011512","CE Attività DIST GAS DIV",100711,11512,605,"Invariata","DIST GAS DIV","       Funzione operativa condivisa di verifica e controllo","       Funzione operativa condivisa di verifica e controllo","       Funzione operativa condivisa di verifica e controllo"]
["100711.000605.011517","CE Attività DIST GAS DIV",100711,11517,605,"Invariata","DIST GAS DIV","       Funzione operativa condivisa di telecontrollo e ricerca perdite","       Funzione operativa condivisa di telecontrollo e ricerca perdite","       Funzione operativa condivisa di telecontrollo e ricerca perdite"]
["100711.000605.011521","CE Attività DIST GAS DIV",100711,11521,605,"Invariata","DIST GAS DIV","       Funzione operativa condivisa di manutenzione e servizi tecnici","       Funzione operativa condivisa di manutenzione e servizi tecnici","       Funzione operativa condivisa di manutenzione e servizi tecnici"]
["100711.000603.000612","CE Attività DIST GAS DIV",100711,612,603,"Invariata","DIST GAS DIV","       Costi attribuiti dai servizi comuni","       Costi attribuiti dai servizi comuni","       Costi attribuiti dai servizi comuni"]
["100711.000612.002010","CE Attività DIST GAS DIV",100711,2010,612,"Invariata","DIST GAS DIV","          Costi attribuiti dai servizi comuni","          Costi attribuiti dai servizi comuni","          Costi attribuiti dai servizi comuni"]
["100711.000603.010957","CE Attività DIST GAS DIV",100711,10957,603,"Invariata","DIST GAS DIV","       Acquisto interno di beni e servizi da altre attività a costo pieno","       Acquisto interno di beni e servizi da altre attività a costo pieno","       Acquisto interno di beni e servizi da altre attività a costo pieno"]
["100711.000000.001143","CE Attività DIST GAS DIV",100711,1143,null,"Invariata","DIST GAS DIV","COSTI DELLA PRODUZIONE (DIRETTI + INDIRETTI)","COSTI DELLA PRODUZIONE (DIRETTI + INDIRETTI)","COSTI DELLA PRODUZIONE (DIRETTI + INDIRETTI)"]
["100711.000000.002009","CE Attività DIST GAS DIV",100711,2009,null,"Invariata","DIST GAS DIV","DIFFERENZA TRA VALORE E COSTI DELLA PRODUZIONE DOPO TRANSAZIONI INTERNE","DIFFERENZA TRA VALORE E COSTI DELLA PRODUZIONE DOPO TRANSAZIONI INTERNE","DIFFERENZA TRA VALORE E COSTI DELLA PRODUZIONE DOPO TRANSAZIONI INTERNE"]
["100711.000000.001144","CE Attività DIST GAS DIV",100711,1144,null,"Invariata","DIST GAS DIV","DIFFERENZA TRA VALORE E COSTI DELLA PRODUZIONE DOPO TRANSAZIONI INTERNE E ATTRIBUZIONE DEI VALORI RELATIVI ALLE FUNZIONI OPERATIVE CONDIVISE E AI SERVIZI COMUNI","DIFFERENZA TRA VALORE E COSTI DELLA PRODUZIONE DOPO TRANSAZIONI INTERNE E ATTRIBUZIONE DEI VALORI RELATIVI ALLE FUNZIONI OPERATIVE CONDIVISE E AI SERVIZI COMUNI","DIFFERENZA TRA VALORE E COSTI DELLA PRODUZIONE DOPO TRANSAZIONI INTERNE E ATTRIBUZIONE DEI VALORI RELATIVI ALLE FUNZIONI OPERATIVE CONDIVISE E AI SERVIZI COMUNI"]
["100843.000000.000001","CE Attività GAS ESTR",100843,1,null,"Invariata","GAS ESTR","  A.1) VALORE DELLA PRODUZIONE COMPRENSIVO DELLE VENDITE INTERNE","  A.1) VALORE DELLA PRODUZIONE COMPRENSIVO DELLE VENDITE INTERNE","  A.1) VALORE DELLA PRODUZIONE COMPRENSIVO DELLE VENDITE INTERNE"]
["100843.000001.000002","CE Attività GAS ESTR",100843,2,1,"Invariata","GAS ESTR","  A) VALORE DELLA PRODUZIONE","  A) VALORE DELLA PRODUZIONE","  A) VALORE DELLA PRODUZIONE"]
["100843.000002.000003","CE Attività GAS ESTR",100843,3,2,"Invariata","GAS ESTR","    1) Ricavi delle vendite e delle prestazioni","    1) Ricavi delle vendite e delle prestazioni","    1) Ricavi delle vendite e delle prestazioni"]
["100843.000003.001149","CE Attività GAS ESTR",100843,1149,3,"Invariata","GAS ESTR"," Ricavi dalle vendite e dalle prestazioni"," Ricavi dalle vendite e dalle prestazioni"," Ricavi dalle vendite e dalle prestazioni"]
["100843.000002.000253","CE Attività GAS ESTR",100843,253,2,"Invariata","GAS ESTR","    2) Variazioni delle rimanenze di prodotti in corso di lavorazione, semilavorati e finiti","    2) Variazioni delle rimanenze di prodotti in corso di lavorazione, semilavorati e finiti","    2) Variazioni delle rimanenze di prodotti in corso di lavorazione, semilavorati e finiti"]
["100843.000253.000254","CE Attività GAS ESTR",100843,254,253,"Invariata","GAS ESTR","       Variazioni delle rimanenze di prodotti in corso di lavorazione, semilavorati e finiti","       Variazioni delle rimanenze di prodotti in corso di lavorazione, semilavorati e finiti","       Variazioni delle rimanenze di prodotti in corso di lavorazione, semilavorati e finiti"]
[{"$f":"CONCATENATE(TEXT(C1124,\"000000\"),\".\",TEXT(E1124,\"000000\"),\".\",TEXT(D1124,\"000000\"))","v":"100843.000002.000255"},"CE Attività GAS ESTR",100843,255,2,"Invariata","GAS ESTR","    3) Variazioni dei lavori in corso su ordinazioni","    3) Variazioni dei lavori in corso su ordinazioni","    3) Variazioni dei lavori in corso su ordinazioni"]
["100843.000255.000256","CE Attività GAS ESTR",100843,256,255,"Invariata","GAS ESTR","       Variazioni dei lavori in corso su ordinazione","       Variazioni dei lavori in corso su ordinazione","       Variazioni dei lavori in corso su ordinazione"]
["100843.000002.000257","CE Attività GAS ESTR",100843,257,2,"Invariata","GAS ESTR","    4) Incrementi di immobilizzazioni per lavori interni ","    4) Incrementi di immobilizzazioni per lavori interni ","    4) Incrementi di immobilizzazioni per lavori interni "]
["100843.000257.002001","CE Attività GAS ESTR",100843,2001,257,"Invariata","GAS ESTR","  Incrementi di immobilizzazioni per lavori interni ","  Incrementi di immobilizzazioni per lavori interni ","  Incrementi di immobilizzazioni per lavori interni "]
["100843.000002.011466","CE Attività GAS ESTR",100843,11466,2,"Invariata","GAS ESTR","    5) Altri ricavi e proventi, con separata indicazione dei contributi in conto esercizio","    5) Altri ricavi e proventi, con separata indicazione dei contributi in conto esercizio","    5) Altri ricavi e proventi, con separata indicazione dei contributi in conto esercizio"]
["100843.011466.011457","CE Attività GAS ESTR",100843,11457,11466,"Invariata","GAS ESTR","   Altri ricavi e proventi","   Altri ricavi e proventi","   Altri ricavi e proventi"]
["100843.000002.012514","CE Attività GAS ESTR",100843,12514,2,"Invariata","GAS ESTR","    5-bis) ricavi non ricorrenti","    5-bis) ricavi non ricorrenti","    5-bis) ricavi non ricorrenti"]
["100843.000001.000302","CE Attività GAS ESTR",100843,302,1,"Invariata","GAS ESTR","  VENDITE INTERNE","  VENDITE INTERNE","  VENDITE INTERNE"]
["100843.000302.000304","CE Attività GAS ESTR",100843,304,302,"Invariata","GAS ESTR","    Vendita interna di beni e servizi ad altre attività a prezzo di mercato","    Vendita interna di beni e servizi ad altre attività a prezzo di mercato","    Vendita interna di beni e servizi ad altre attività a prezzo di mercato"]
["100843.000302.010968","CE Attività GAS ESTR",100843,10968,302,"Invariata","GAS ESTR","    Vendita interna di beni e servizi ad altre attività a costo pieno","    Vendita interna di beni e servizi ad altre attività a costo pieno","    Vendita interna di beni e servizi ad altre attività a costo pieno"]
["100843.000000.000307","CE Attività GAS ESTR",100843,307,null,"Invariata","GAS ESTR","B.1) COSTI DELLA PRODUZIONE COMPRENSIVI DEGLI ACQUISTI INTERNI","B.1) COSTI DELLA PRODUZIONE COMPRENSIVI DEGLI ACQUISTI INTERNI","B.1) COSTI DELLA PRODUZIONE COMPRENSIVI DEGLI ACQUISTI INTERNI"]
["100843.000307.000308","CE Attività GAS ESTR",100843,308,307,"Invariata","GAS ESTR","  B) COSTI DELLA PRODUZIONE","  B) COSTI DELLA PRODUZIONE","  B) COSTI DELLA PRODUZIONE"]
["100843.000308.000309","CE Attività GAS ESTR",100843,309,308,"Invariata","GAS ESTR","    6) Per materie prime, sussidiarie, di consumo e di merci (a livello di attività vanno riportati i consumi)","    6) Per materie prime, sussidiarie, di consumo e di merci (a livello di attività vanno riportati i consumi)","    6) Per materie prime, sussidiarie, di consumo e di merci (a livello di attività vanno riportati i consumi)"]
["100843.000309.002007","CE Attività GAS ESTR",100843,2007,309,"Invariata","GAS ESTR","Per acquisto e trasporto dell'energia","Per acquisto e trasporto dell'energia","Per acquisto e trasporto dell'energia"]
["100843.000309.002008","CE Attività GAS ESTR",100843,2008,309,"Invariata","GAS ESTR","Altri costi di materie prime, sussidiarie, di consumo e di merci","Altri costi di materie prime, sussidiarie, di consumo e di merci","Altri costi di materie prime, sussidiarie, di consumo e di merci"]
["100843.000308.000416","CE Attività GAS ESTR",100843,416,308,"Invariata","GAS ESTR","    7) Per servizi","    7) Per servizi","    7) Per servizi"]
["100843.000416.002003","CE Attività GAS ESTR",100843,2003,416,"Invariata","GAS ESTR","     Per servizi","     Per servizi","     Per servizi"]
["100843.000308.000511","CE Attività GAS ESTR",100843,511,308,"Invariata","GAS ESTR","    8) Per godimento beni di terzi","    8) Per godimento beni di terzi","    8) Per godimento beni di terzi"]
["100843.000511.002004","CE Attività GAS ESTR",100843,2004,511,"Invariata","GAS ESTR","          Per godimento beni di terzi","          Per godimento beni di terzi","          Per godimento beni di terzi"]
["100843.000308.000532","CE Attività GAS ESTR",100843,532,308,"Invariata","GAS ESTR","    9) Per il personale ","    9) Per il personale ","    9) Per il personale "]
["100843.000532.002005","CE Attività GAS ESTR",100843,2005,532,"Invariata","GAS ESTR","    Per il personale ","    Per il personale ","    Per il personale "]
["100843.000308.000544","CE Attività GAS ESTR",100843,544,308,"Invariata","GAS ESTR","    10) Ammortamenti e svalutazioni","    10) Ammortamenti e svalutazioni","    10) Ammortamenti e svalutazioni"]
["100843.000544.000545","CE Attività GAS ESTR",100843,545,544,"Invariata","GAS ESTR","       Ammortamento delle immobilizzazioni immateriali","       Ammortamento delle immobilizzazioni immateriali","       Ammortamento delle immobilizzazioni immateriali"]
["100843.000544.000547","CE Attività GAS ESTR",100843,547,544,"Invariata","GAS ESTR","       Ammortamento delle immobilizzazioni materiali (ammortamento tecnicoeconomico)","       Ammortamento delle immobilizzazioni materiali (ammortamento tecnicoeconomico)","       Ammortamento delle immobilizzazioni materiali (ammortamento tecnicoeconomico)"]
["100843.000544.000548","CE Attività GAS ESTR",100843,548,544,"Invariata","GAS ESTR","       Ammortamento delle immobilizzazioni materiali (ammortamento finanziario)","       Ammortamento delle immobilizzazioni materiali (ammortamento finanziario)","       Ammortamento delle immobilizzazioni materiali (ammortamento finanziario)"]
["100843.000544.000549","CE Attività GAS ESTR",100843,549,544,"Invariata","GAS ESTR","       Altre svalutazioni delle immobilizzazioni","       Altre svalutazioni delle immobilizzazioni","       Altre svalutazioni delle immobilizzazioni"]
["100843.000544.000550","CE Attività GAS ESTR",100843,550,544,"Invariata","GAS ESTR","       Svalutazione dei crediti compresi nell'attivo circolante e delle disponibilità","       Svalutazione dei crediti compresi nell'attivo circolante e delle disponibilità","       Svalutazione dei crediti compresi nell'attivo circolante e delle disponibilità"]
["100843.000308.000554","CE Attività GAS ESTR",100843,554,308,"Invariata","GAS ESTR","    12) Accantonamenti per rischi","    12) Accantonamenti per rischi","    12) Accantonamenti per rischi"]
["100843.000554.001135","CE Attività GAS ESTR",100843,1135,554,"Invariata","GAS ESTR","          - accantonamenti per rischi ","          - accantonamenti per rischi ","          - accantonamenti per rischi "]
["100843.000308.000558","CE Attività GAS ESTR",100843,558,308,"Invariata","GAS ESTR","    13) Altri accantonamenti","    13) Altri accantonamenti","    13) Altri accantonamenti"]
["100843.000558.000559","CE Attività GAS ESTR",100843,559,558,"Invariata","GAS ESTR","       Altri accantonamenti","       Altri accantonamenti","       Altri accantonamenti"]
["100843.000308.000560","CE Attività GAS ESTR",100843,560,308,{"$f":"IF(TRIM(H1155)=TRIM(I1155),\"Invariata\",IF(H1155=\"\",\"Aggiunta\",IF(I1155=\"\",\"Eliminata\",\"Modificata\")))","v":"Invariata"},"GAS ESTR","    14) Oneri diversi di gestione","    14) Oneri diversi di gestione","    14) Oneri diversi di gestione"]
["100843.000560.002006","CE Attività GAS ESTR",100843,2006,560,"Invariata","GAS ESTR","   Oneri diversi di gestione","   Oneri diversi di gestione","   Oneri diversi di gestione"]
["100843.000308.012515","CE Attività GAS ESTR",100843,12515,308,"Invariata","GAS ESTR","    14-bis ) oneri non ricorrenti","    14-bis ) oneri non ricorrenti","    14-bis ) oneri non ricorrenti"]
["100843.000307.000574","CE Attività GAS ESTR",100843,574,307,"Invariata","GAS ESTR","  ACQUISTI INTERNI","  ACQUISTI INTERNI","  ACQUISTI INTERNI"]
["100843.000574.010916","CE Attività GAS ESTR",100843,10916,574,"Invariata","GAS ESTR","       Acquisto interno di beni e servizi da altre attività a prezzo di mercato","       Acquisto interno di beni e servizi da altre attività a prezzo di mercato","       Acquisto interno di beni e servizi da altre attività a prezzo di mercato"]
["100843.000000.001142","CE Attività GAS ESTR",100843,1142,null,"Invariata","GAS ESTR","DIFFERENZA TRA VALORE E COSTI DELLA PRODUZIONE","DIFFERENZA TRA VALORE E COSTI DELLA PRODUZIONE","DIFFERENZA TRA VALORE E COSTI DELLA PRODUZIONE"]
["100843.000000.000603","CE Attività GAS ESTR",100843,603,null,"Invariata","GAS ESTR","   COSTI INDIRETTI","   COSTI INDIRETTI","   COSTI INDIRETTI"]
["100843.000603.000605","CE Attività GAS ESTR",100843,605,603,"Invariata","GAS ESTR","       Costi attribuiti dalle funzioni operative condivise","       Costi attribuiti dalle funzioni operative condivise","       Costi attribuiti dalle funzioni operative condivise"]
["100843.000605.000608","CE Attività GAS ESTR",100843,608,605,"Invariata","GAS ESTR","       Funzione operativa condivisa di misura tra attività di settori diversi o tra attività diverse del settore idrico","       Funzione operativa condivisa di misura tra attività di settori diversi o tra attività diverse del settore idrico","       Funzione operativa condivisa di misura tra attività di settori diversi o tra attività diverse del settore idrico"]
["100843.000605.000610","CE Attività GAS ESTR",100843,610,605,"Invariata","GAS ESTR","          Funzione operativa condivisa di cartografia elettronica","          Funzione operativa condivisa di cartografia elettronica","          Funzione operativa condivisa di cartografia elettronica"]
["100843.000605.010937","CE Attività GAS ESTR",100843,10937,605,"Invariata","GAS ESTR","       Funzione operativa condivisa commerciale, di vendita e gestione clientela del settore elettrico","       Funzione operativa condivisa commerciale, di vendita e gestione clientela del settore elettrico","       Funzione operativa condivisa commerciale, di vendita e gestione clientela del settore elettrico"]
["100843.000605.010938","CE Attività GAS ESTR",100843,10938,605,"Invariata","GAS ESTR","       Funzione operativa condivisa commerciale, di vendita e gestione clientela del settore gas","       Funzione operativa condivisa commerciale, di vendita e gestione clientela del settore gas","       Funzione operativa condivisa commerciale, di vendita e gestione clientela del settore gas"]
["100843.000605.010939","CE Attività GAS ESTR",100843,10939,605,"Invariata","GAS ESTR","       Funzione operativa condivisa commerciale, di vendita e gestione clientela comune al settore elettrico e gas","       Funzione operativa condivisa commerciale, di vendita e gestione clientela comune al settore elettrico e gas","       Funzione operativa condivisa commerciale, di vendita e gestione clientela comune al settore elettrico e gas"]
["100843.000605.010940","CE Attività GAS ESTR",100843,10940,605,"Invariata","GAS ESTR","       Funzione operativa condivisa di acquisto di energia elettrica","       Funzione operativa condivisa di acquisto di energia elettrica","       Funzione operativa condivisa di acquisto di energia elettrica"]
["100843.000605.010941","CE Attività GAS ESTR",100843,10941,605,"Invariata","GAS ESTR","       Funzione operativa condivisa di acquisto di gas","       Funzione operativa condivisa di acquisto di gas","       Funzione operativa condivisa di acquisto di gas"]
["100843.000605.010942","CE Attività GAS ESTR",100843,10942,605,"Invariata","GAS ESTR","       Funzione operativa condivisa di acquisto comune di energia elettrica e di gas","       Funzione operativa condivisa di acquisto comune di energia elettrica e di gas","       Funzione operativa condivisa di acquisto comune di energia elettrica e di gas"]
["100843.000605.011512","CE Attività GAS ESTR",100843,11512,605,"Invariata","GAS ESTR","       Funzione operativa condivisa di verifica e controllo","       Funzione operativa condivisa di verifica e controllo","       Funzione operativa condivisa di verifica e controllo"]
["100843.000605.011517","CE Attività GAS ESTR",100843,11517,605,"Invariata","GAS ESTR","       Funzione operativa condivisa di telecontrollo e ricerca perdite","       Funzione operativa condivisa di telecontrollo e ricerca perdite","       Funzione operativa condivisa di telecontrollo e ricerca perdite"]
["100843.000605.011521","CE Attività GAS ESTR",100843,11521,605,"Invariata","GAS ESTR","       Funzione operativa condivisa di manutenzione e servizi tecnici","       Funzione operativa condivisa di manutenzione e servizi tecnici","       Funzione operativa condivisa di manutenzione e servizi tecnici"]
["100843.000603.000612","CE Attività GAS ESTR",100843,612,603,"Invariata","GAS ESTR","       Costi attribuiti dai servizi comuni","       Costi attribuiti dai servizi comuni","       Costi attribuiti dai servizi comuni"]
["100843.000612.002010","CE Attività GAS ESTR",100843,2010,612,"Invariata","GAS ESTR","          Costi attribuiti dai servizi comuni","          Costi attribuiti dai servizi comuni","          Costi attribuiti dai servizi comuni"]
["100843.000603.010957","CE Attività GAS ESTR",100843,10957,603,"Invariata","GAS ESTR","       Acquisto interno di beni e servizi da altre attività a costo pieno","       Acquisto interno di beni e servizi da altre attività a costo pieno","       Acquisto interno di beni e servizi da altre attività a costo pieno"]
["100843.000000.001143","CE Attività GAS ESTR",100843,1143,null,"Invariata","GAS ESTR","COSTI DELLA PRODUZIONE (DIRETTI + INDIRETTI)","COSTI DELLA PRODUZIONE (DIRETTI + INDIRETTI)","COSTI DELLA PRODUZIONE (DIRETTI + INDIRETTI)"]
["100843.000000.002009","CE Attività GAS ESTR",100843,2009,null,"Invariata","GAS ESTR","DIFFERENZA TRA VALORE E COSTI DELLA PRODUZIONE DOPO TRANSAZIONI INTERNE","DIFFERENZA TRA VALORE E COSTI DELLA PRODUZIONE DOPO TRANSAZIONI INTERNE","DIFFERENZA TRA VALORE E COSTI DELLA PRODUZIONE DOPO TRANSAZIONI INTERNE"]
["100843.000000.001144","CE Attività GAS ESTR",100843,1144,null,"Invariata","GAS ESTR","DIFFERENZA TRA VALORE E COSTI DELLA PRODUZIONE DOPO TRANSAZIONI INTERNE E ATTRIBUZIONE DEI VALORI RELATIVI ALLE FUNZIONI OPERATIVE CONDIVISE E AI SERVIZI COMUNI","DIFFERENZA TRA VALORE E COSTI DELLA PRODUZIONE DOPO TRANSAZIONI INTERNE E ATTRIBUZIONE DEI VALORI RELATIVI ALLE FUNZIONI OPERATIVE CONDIVISE E AI SERVIZI COMUNI","DIFFERENZA TRA VALORE E COSTI DELLA PRODUZIONE DOPO TRANSAZIONI INTERNE E ATTRIBUZIONE DEI VALORI RELATIVI ALLE FUNZIONI OPERATIVE CONDIVISE E AI SERVIZI COMUNI"]
["100772.000000.000001","CE Attività ATT DIVT",100772,1,null,"Invariata","ATT DIVT","  A.1) VALORE DELLA PRODUZIONE COMPRENSIVO DELLE VENDITE INTERNE","  A.1) VALORE DELLA PRODUZIONE COMPRENSIVO DELLE VENDITE INTERNE","  A.1) VALORE DELLA PRODUZIONE COMPRENSIVO DELLE VENDITE INTERNE"]
["100772.000001.000002","CE Attività ATT DIVT",100772,2,1,"Invariata","ATT DIVT","  A) VALORE DELLA PRODUZIONE","  A) VALORE DELLA PRODUZIONE","  A) VALORE DELLA PRODUZIONE"]
["100772.000002.000003","CE Attività ATT DIVT",100772,3,2,"Invariata","ATT DIVT","    1) Ricavi delle vendite e delle prestazioni","    1) Ricavi delle vendite e delle prestazioni","    1) Ricavi delle vendite e delle prestazioni"]
["100772.000003.001149","CE Attività ATT DIVT",100772,1149,3,"Invariata","ATT DIVT"," Ricavi dalle vendite e dalle prestazioni"," Ricavi dalle vendite e dalle prestazioni"," Ricavi dalle vendite e dalle prestazioni"]
["100772.000002.000253","CE Attività ATT DIVT",100772,253,2,"Invariata","ATT DIVT","    2) Variazioni delle rimanenze di prodotti in corso di lavorazione, semilavorati e finiti","    2) Variazioni delle rimanenze di prodotti in corso di lavorazione, semilavorati e finiti","    2) Variazioni delle rimanenze di prodotti in corso di lavorazione, semilavorati e finiti"]
["100772.000253.000254","CE Attività ATT DIVT",100772,254,253,"Invariata","ATT DIVT","       Variazioni delle rimanenze di prodotti in corso di lavorazione, semilavorati e finiti","       Variazioni delle rimanenze di prodotti in corso di lavorazione, semilavorati e finiti","       Variazioni delle rimanenze di prodotti in corso di lavorazione, semilavorati e finiti"]
["100772.000002.000255","CE Attività ATT DIVT",100772,255,2,"Invariata","ATT DIVT","    3) Variazioni dei lavori in corso su ordinazioni","    3) Variazioni dei lavori in corso su ordinazioni","    3) Variazioni dei lavori in corso su ordinazioni"]
["100772.000255.000256","CE Attività ATT DIVT",100772,256,255,"Invariata","ATT DIVT","       Variazioni dei lavori in corso su ordinazione","       Variazioni dei lavori in corso su ordinazione","       Variazioni dei lavori in corso su ordinazione"]
[{"$f":"CONCATENATE(TEXT(C1188,\"000000\"),\".\",TEXT(E1188,\"000000\"),\".\",TEXT(D1188,\"000000\"))","v":"100772.000002.000257"},"CE Attività ATT DIVT",100772,257,2,"Invariata","ATT DIVT","    4) Incrementi di immobilizzazioni per lavori interni ","    4) Incrementi di immobilizzazioni per lavori interni ","    4) Incrementi di immobilizzazioni per lavori interni "]
["100772.000257.002001","CE Attività ATT DIVT",100772,2001,257,"Invariata","ATT DIVT","  Incrementi di immobilizzazioni per lavori interni ","  Incrementi di immobilizzazioni per lavori interni ","  Incrementi di immobilizzazioni per lavori interni "]
["100772.000002.011466","CE Attività ATT DIVT",100772,11466,2,"Invariata","ATT DIVT","    5) Altri ricavi e proventi, con separata indicazione dei contributi in conto esercizio","    5) Altri ricavi e proventi, con separata indicazione dei contributi in conto esercizio","    5) Altri ricavi e proventi, con separata indicazione dei contributi in conto esercizio"]
["100772.011466.011457","CE Attività ATT DIVT",100772,11457,11466,"Invariata","ATT DIVT","   Altri ricavi e proventi","   Altri ricavi e proventi","   Altri ricavi e proventi"]
["100772.000002.012514","CE Attività ATT DIVT",100772,12514,2,"Invariata","ATT DIVT","    5-bis) ricavi non ricorrenti","    5-bis) ricavi non ricorrenti","    5-bis) ricavi non ricorrenti"]
["100772.000001.000302","CE Attività ATT DIVT",100772,302,1,"Invariata","ATT DIVT","  VENDITE INTERNE","  VENDITE INTERNE","  VENDITE INTERNE"]
["100772.000302.000304","CE Attività ATT DIVT",100772,304,302,"Invariata","ATT DIVT","    Vendita interna di beni e servizi ad altre attività a prezzo di mercato","    Vendita interna di beni e servizi ad altre attività a prezzo di mercato","    Vendita interna di beni e servizi ad altre attività a prezzo di mercato"]
["100772.000302.010968","CE Attività ATT DIVT",100772,10968,302,"Invariata","ATT DIVT","    Vendita interna di beni e servizi ad altre attività a costo pieno","    Vendita interna di beni e servizi ad altre attività a costo pieno","    Vendita interna di beni e servizi ad altre attività a costo pieno"]
["100772.000000.000307","CE Attività ATT DIVT",100772,307,null,"Invariata","ATT DIVT","B.1) COSTI DELLA PRODUZIONE COMPRENSIVI DEGLI ACQUISTI INTERNI","B.1) COSTI DELLA PRODUZIONE COMPRENSIVI DEGLI ACQUISTI INTERNI","B.1) COSTI DELLA PRODUZIONE COMPRENSIVI DEGLI ACQUISTI INTERNI"]
["100772.000307.000308","CE Attività ATT DIVT",100772,308,307,"Invariata","ATT DIVT","  B) COSTI DELLA PRODUZIONE","  B) COSTI DELLA PRODUZIONE","  B) COSTI DELLA PRODUZIONE"]
["100772.000308.000309","CE Attività ATT DIVT",100772,309,308,"Invariata","ATT DIVT","    6) Per materie prime, sussidiarie, di consumo e di merci (a livello di attività vanno riportati i consumi)","    6) Per materie prime, sussidiarie, di consumo e di merci (a livello di attività vanno riportati i consumi)","    6) Per materie prime, sussidiarie, di consumo e di merci (a livello di attività vanno riportati i consumi)"]
["100772.000309.002007","CE Attività ATT DIVT",100772,2007,309,"Invariata","ATT DIVT","Per acquisto e trasporto dell'energia","Per acquisto e trasporto dell'energia","Per acquisto e trasporto dell'energia"]
["100772.000309.002008","CE Attività ATT DIVT",100772,2008,309,"Invariata","ATT DIVT","Altri costi di materie prime, sussidiarie, di consumo e di merci","Altri costi di materie prime, sussidiarie, di consumo e di merci","Altri costi di materie prime, sussidiarie, di consumo e di merci"]
["100772.000308.000416","CE Attività ATT DIVT",100772,416,308,"Invariata","ATT DIVT","    7) Per servizi","    7) Per servizi","    7) Per servizi"]
["100772.000416.002003","CE Attività ATT DIVT",100772,2003,416,"Invariata","ATT DIVT","     Per servizi","     Per servizi","     Per servizi"]
["100772.000308.000511","CE Attività ATT DIVT",100772,511,308,"Invariata","ATT DIVT","    8) Per godimento beni di terzi","    8) Per godimento beni di terzi","    8) Per godimento beni di terzi"]
["100772.000511.002004","CE Attività ATT DIVT",100772,2004,511,"Invariata","ATT DIVT","          Per godimento beni di terzi","          Per godimento beni di terzi","          Per godimento beni di terzi"]
["100772.000308.000532","CE Attività ATT DIVT",100772,532,308,"Invariata","ATT DIVT","    9) Per il personale ","    9) Per il personale ","    9) Per il personale "]
["100772.000532.002005","CE Attività ATT DIVT",100772,2005,532,"Invariata","ATT DIVT","    Per il personale ","    Per il personale ","    Per il personale "]
["100772.000308.000544","CE Attività ATT DIVT",100772,544,308,"Invariata","ATT DIVT","    10) Ammortamenti e svalutazioni","    10) Ammortamenti e svalutazioni","    10) Ammortamenti e svalutazioni"]
["100772.000544.000545","CE Attività ATT DIVT",100772,545,544,"Invariata","ATT DIVT","       Ammortamento delle immobilizzazioni immateriali","       Ammortamento delle immobilizzazioni immateriali","       Ammortamento delle immobilizzazioni immateriali"]
["100772.000544.000547","CE Attività ATT DIVT",100772,547,544,"Invariata","ATT DIVT","       Ammortamento delle immobilizzazioni materiali (ammortamento tecnicoeconomico)","       Ammortamento delle immobilizzazioni materiali (ammortamento tecnicoeconomico)","       Ammortamento delle immobilizzazioni materiali (ammortamento tecnicoeconomico)"]
["100772.000544.000548","CE Attività ATT DIVT",100772,548,544,"Invariata","ATT DIVT","       Ammortamento delle immobilizzazioni materiali (ammortamento finanziario)","       Ammortamento delle immobilizzazioni materiali (ammortamento finanziario)","       Ammortamento delle immobilizzazioni materiali (ammortamento finanziario)"]
["100772.000544.000549","CE Attività ATT DIVT",100772,549,544,"Invariata","ATT DIVT","       Altre svalutazioni delle immobilizzazioni","       Altre svalutazioni delle immobilizzazioni","       Altre svalutazioni delle immobilizzazioni"]
["100772.000544.000550","CE Attività ATT DIVT",100772,550,544,"Invariata","ATT DIVT","       Svalutazione dei crediti compresi nell'attivo circolante e delle disponibilità","       Svalutazione dei crediti compresi nell'attivo circolante e delle disponibilità","       Svalutazione dei crediti compresi nell'attivo circolante e delle disponibilità"]
["100772.000308.000554","CE Attività ATT DIVT",100772,554,308,"Invariata","ATT DIVT","    12) Accantonamenti per rischi","    12) Accantonamenti per rischi","    12) Accantonamenti per rischi"]
["100772.000554.001135","CE Attività ATT DIVT",100772,1135,554,"Invariata","ATT DIVT","          - accantonamenti per rischi ","          - accantonamenti per rischi ","          - accantonamenti per rischi "]
["100772.000308.000558","CE Attività ATT DIVT",100772,558,308,"Invariata","ATT DIVT","    13) Altri accantonamenti","    13) Altri accantonamenti","    13) Altri accantonamenti"]
["100772.000558.000559","CE Attività ATT DIVT",100772,559,558,"Invariata","ATT DIVT","       Altri accantonamenti","       Altri accantonamenti","       Altri accantonamenti"]
["100772.000308.000560","CE Attività ATT DIVT",100772,560,308,"Invariata","ATT DIVT","    14) Oneri diversi di gestione","    14) Oneri diversi di gestione","    14) Oneri diversi di gestione"]
["100772.000560.002006","CE Attività ATT DIVT",100772,2006,560,"Invariata","ATT DIVT","   Oneri diversi di gestione","   Oneri diversi di gestione","   Oneri diversi di gestione"]
["100772.000308.012515","CE Attività ATT DIVT",100772,12515,308,{"$f":"IF(TRIM(H1219)=TRIM(I1219),\"Invariata\",IF(H1219=\"\",\"Aggiunta\",IF(I1219=\"\",\"Eliminata\",\"Modificata\")))","v":"Invariata"},"ATT DIVT","    14-bis ) oneri non ricorrenti","    14-bis ) oneri non ricorrenti","    14-bis ) oneri non ricorrenti"]
["100772.000307.000574","CE Attività ATT DIVT",100772,574,307,"Invariata","ATT DIVT","  ACQUISTI INTERNI","  ACQUISTI INTERNI","  ACQUISTI INTERNI"]
["100772.000574.010916","CE Attività ATT DIVT",100772,10916,574,"Invariata","ATT DIVT","       Acquisto interno di beni e servizi da altre attività a prezzo di mercato","       Acquisto interno di beni e servizi da altre attività a prezzo di mercato","       Acquisto interno di beni e servizi da altre attività a prezzo di mercato"]
["100772.000000.001142","CE Attività ATT DIVT",100772,1142,null,"Invariata","ATT DIVT","DIFFERENZA TRA VALORE E COSTI DELLA PRODUZIONE","DIFFERENZA TRA VALORE E COSTI DELLA PRODUZIONE","DIFFERENZA TRA VALORE E COSTI DELLA PRODUZIONE"]
["100772.000000.000603","CE Attività ATT DIVT",100772,603,null,"Invariata","ATT DIVT","   COSTI INDIRETTI","   COSTI INDIRETTI","   COSTI INDIRETTI"]
["100772.000603.000605","CE Attività ATT DIVT",100772,605,603,"Invariata","ATT DIVT","       Costi attribuiti dalle funzioni operative condivise","       Costi attribuiti dalle funzioni operative condivise","       Costi attribuiti dalle funzioni operative condivise"]
["100772.000605.000608","CE Attività ATT DIVT",100772,608,605,"Invariata","ATT DIVT","       Funzione operativa condivisa di misura tra attività di settori diversi o tra attività diverse del settore idrico","       Funzione operativa condivisa di misura tra attività di settori diversi o tra attività diverse del settore idrico","       Funzione operativa condivisa di misura tra attività di settori diversi o tra attività diverse del settore idrico"]
["100772.000605.000610","CE Attività ATT DIVT",100772,610,605,"Invariata","ATT DIVT","          Funzione operativa condivisa di cartografia elettronica","          Funzione operativa condivisa di cartografia elettronica","          Funzione operativa condivisa di cartografia elettronica"]
["100772.000605.010937","CE Attività ATT DIVT",100772,10937,605,"Invariata","ATT DIVT","       Funzione operativa condivisa commerciale, di vendita e gestione clientela del settore elettrico","       Funzione operativa condivisa commerciale, di vendita e gestione clientela del settore elettrico","       Funzione operativa condivisa commerciale, di vendita e gestione clientela del settore elettrico"]
["100772.000605.010938","CE Attività ATT DIVT",100772,10938,605,"Invariata","ATT DIVT","       Funzione operativa condivisa commerciale, di vendita e gestione clientela del settore gas","       Funzione operativa condivisa commerciale, di vendita e gestione clientela del settore gas","       Funzione operativa condivisa commerciale, di vendita e gestione clientela del settore gas"]
["100772.000605.010939","CE Attività ATT DIVT",100772,10939,605,"Invariata","ATT DIVT","       Funzione operativa condivisa commerciale, di vendita e gestione clientela comune al settore elettrico e gas","       Funzione operativa condivisa commerciale, di vendita e gestione clientela comune al settore elettrico e gas","       Funzione operativa condivisa commerciale, di vendita e gestione clientela comune al settore elettrico e gas"]
["100772.000605.010940","CE Attività ATT DIVT",100772,10940,605,"Invariata","ATT DIVT","       Funzione operativa condivisa di acquisto di energia elettrica","       Funzione operativa condivisa di acquisto di energia elettrica","       Funzione operativa condivisa di acquisto di energia elettrica"]
["100772.000605.010941","CE Attività ATT DIVT",100772,10941,605,"Invariata","ATT DIVT","       Funzione operativa condivisa di acquisto di gas","       Funzione operativa condivisa di acquisto di gas","       Funzione operativa condivisa di acquisto di gas"]
["100772.000605.010942","CE Attività ATT DIVT",100772,10942,605,"Invariata","ATT DIVT","       Funzione operativa condivisa di acquisto comune di energia elettrica e di gas","       Funzione operativa condivisa di acquisto comune di energia elettrica e di gas","       Funzione operativa condivisa di acquisto comune di energia elettrica e di gas"]
["100772.000605.011512","CE Attività ATT DIVT",100772,11512,605,"Invariata","ATT DIVT","       Funzione operativa condivisa di verifica e controllo","       Funzione operativa condivisa di verifica e controllo","       Funzione operativa condivisa di verifica e controllo"]
["100772.000605.011517","CE Attività ATT DIVT",100772,11517,605,"Invariata","ATT DIVT","       Funzione operativa condivisa di telecontrollo e ricerca perdite","       Funzione operativa condivisa di telecontrollo e ricerca perdite","       Funzione operativa condivisa di telecontrollo e ricerca perdite"]
["100772.000605.011521","CE Attività ATT DIVT",100772,11521,605,"Invariata","ATT DIVT","       Funzione operativa condivisa di manutenzione e servizi tecnici","       Funzione operativa condivisa di manutenzione e servizi tecnici","       Funzione operativa condivisa di manutenzione e servizi tecnici"]
["100772.000603.000612","CE Attività ATT DIVT",100772,612,603,"Invariata","ATT DIVT","       Costi attribuiti dai servizi comuni","       Costi attribuiti dai servizi comuni","       Costi attribuiti dai servizi comuni"]
["100772.000612.002010","CE Attività ATT DIVT",100772,2010,612,"Invariata","ATT DIVT","          Costi attribuiti dai servizi comuni","          Costi attribuiti dai servizi comuni","          Costi attribuiti dai servizi comuni"]
["100772.000603.010957","CE Attività ATT DIVT",100772,10957,603,"Invariata","ATT DIVT","       Acquisto interno di beni e servizi da altre attività a costo pieno","       Acquisto interno di beni e servizi da altre attività a costo pieno","       Acquisto interno di beni e servizi da altre attività a costo pieno"]
["100772.000000.001143","CE Attività ATT DIVT",100772,1143,null,"Invariata","ATT DIVT","COSTI DELLA PRODUZIONE (DIRETTI + INDIRETTI)","COSTI DELLA PRODUZIONE (DIRETTI + INDIRETTI)","COSTI DELLA PRODUZIONE (DIRETTI + INDIRETTI)"]
["100772.000000.002009","CE Attività ATT DIVT",100772,2009,null,"Invariata","ATT DIVT","DIFFERENZA TRA VALORE E COSTI DELLA PRODUZIONE DOPO TRANSAZIONI INTERNE","DIFFERENZA TRA VALORE E COSTI DELLA PRODUZIONE DOPO TRANSAZIONI INTERNE","DIFFERENZA TRA VALORE E COSTI DELLA PRODUZIONE DOPO TRANSAZIONI INTERNE"]
["100772.000000.001144","CE Attività ATT DIVT",100772,1144,null,"Invariata","ATT DIVT","DIFFERENZA TRA VALORE E COSTI DELLA PRODUZIONE DOPO TRANSAZIONI INTERNE E ATTRIBUZIONE DEI VALORI RELATIVI ALLE FUNZIONI OPERATIVE CONDIVISE E AI SERVIZI COMUNI","DIFFERENZA TRA VALORE E COSTI DELLA PRODUZIONE DOPO TRANSAZIONI INTERNE E ATTRIBUZIONE DEI VALORI RELATIVI ALLE FUNZIONI OPERATIVE CONDIVISE E AI SERVIZI COMUNI","DIFFERENZA TRA VALORE E COSTI DELLA PRODUZIONE DOPO TRANSAZIONI INTERNE E ATTRIBUZIONE DEI VALORI RELATIVI ALLE FUNZIONI OPERATIVE CONDIVISE E AI SERVIZI COMUNI"]
["000293.000000.000001","CE per FOC",293,1,null,"Invariata","FOC","  A.1) VALORE DELLA PRODUZIONE COMPRENSIVO DELLE VENDITE INTERNE","  A.1) VALORE DELLA PRODUZIONE COMPRENSIVO DELLE VENDITE INTERNE","  A.1) VALORE DELLA PRODUZIONE COMPRENSIVO DELLE VENDITE INTERNE"]
["000293.000001.000002","CE per FOC",293,2,1,"Invariata","FOC","  A) VALORE DELLA PRODUZIONE","  A) VALORE DELLA PRODUZIONE","  A) VALORE DELLA PRODUZIONE"]
["000293.000002.000003","CE per FOC",293,3,2,"Invariata","FOC","    1) Ricavi delle vendite e delle prestazioni","    1) Ricavi delle vendite e delle prestazioni","    1) Ricavi delle vendite e delle prestazioni"]
["000293.000003.001149","CE per FOC",293,1149,3,"Invariata","FOC"," Ricavi dalle vendite e dalle prestazioni"," Ricavi dalle vendite e dalle prestazioni"," Ricavi dalle vendite e dalle prestazioni"]
["000293.000002.000253","CE per FOC",293,253,2,"Invariata","FOC","    2) Variazioni delle rimanenze di prodotti in corso di lavorazione, semilavorati e finiti","    2) Variazioni delle rimanenze di prodotti in corso di lavorazione, semilavorati e finiti","    2) Variazioni delle rimanenze di prodotti in corso di lavorazione, semilavorati e finiti"]
["000293.000253.000254","CE per FOC",293,254,253,"Invariata","FOC","       Variazioni delle rimanenze di prodotti in corso di lavorazione, semilavorati e finiti","       Variazioni delle rimanenze di prodotti in corso di lavorazione, semilavorati e finiti","       Variazioni delle rimanenze di prodotti in corso di lavorazione, semilavorati e finiti"]
["000293.000002.000255","CE per FOC",293,255,2,"Invariata","FOC","    3) Variazioni dei lavori in corso su ordinazioni","    3) Variazioni dei lavori in corso su ordinazioni","    3) Variazioni dei lavori in corso su ordinazioni"]
["000293.000255.000256","CE per FOC",293,256,255,"Invariata","FOC","       Variazioni dei lavori in corso su ordinazione","       Variazioni dei lavori in corso su ordinazione","       Variazioni dei lavori in corso su ordinazione"]
["000293.000002.000257","CE per FOC",293,257,2,"Invariata","FOC","    4) Incrementi di immobilizzazioni per lavori interni ","    4) Incrementi di immobilizzazioni per lavori interni ","    4) Incrementi di immobilizzazioni per lavori interni "]
["000293.000257.002001","CE per FOC",293,2001,257,"Invariata","FOC","  Incrementi di immobilizzazioni per lavori interni ","  Incrementi di immobilizzazioni per lavori interni ","  Incrementi di immobilizzazioni per lavori interni "]
[{"$f":"CONCATENATE(TEXT(C1252,\"000000\"),\".\",TEXT(E1252,\"000000\"),\".\",TEXT(D1252,\"000000\"))","v":"000293.000002.011466"},"CE per FOC",293,11466,2,"Invariata","FOC","    5) Altri ricavi e proventi, con separata indicazione dei contributi in conto esercizio","    5) Altri ricavi e proventi, con separata indicazione dei contributi in conto esercizio","    5) Altri ricavi e proventi, con separata indicazione dei contributi in conto esercizio"]
["000293.011466.011457","CE per FOC",293,11457,11466,"Invariata","FOC","   Altri ricavi e proventi","   Altri ricavi e proventi","   Altri ricavi e proventi"]
["000293.000002.012514","CE per FOC",293,12514,2,"Invariata","FOC","    5-bis) ricavi non ricorrenti","    5-bis) ricavi non ricorrenti","    5-bis) ricavi non ricorrenti"]
["000293.000001.000302","CE per FOC",293,302,1,"Invariata","FOC","  VENDITE INTERNE","  VENDITE INTERNE","  VENDITE INTERNE"]
["000293.000000.000307","CE per FOC",293,307,null,"Invariata","FOC","B.1) COSTI DELLA PRODUZIONE COMPRENSIVI DEGLI ACQUISTI INTERNI","B.1) COSTI DELLA PRODUZIONE COMPRENSIVI DEGLI ACQUISTI INTERNI","B.1) COSTI DELLA PRODUZIONE COMPRENSIVI DEGLI ACQUISTI INTERNI"]
["000293.000307.000308","CE per FOC",293,308,307,"Invariata","FOC","  B) COSTI DELLA PRODUZIONE","  B) COSTI DELLA PRODUZIONE","  B) COSTI DELLA PRODUZIONE"]
["000293.000308.000309","CE per FOC",293,309,308,"Invariata","FOC","    6) Per materie prime, sussidiarie, di consumo e di merci (a livello di attività vanno riportati i consumi)","    6) Per materie prime, sussidiarie, di consumo e di merci (a livello di attività vanno riportati i consumi)","    6) Per materie prime, sussidiarie, di consumo e di merci (a livello di attività vanno riportati i consumi)"]
["000293.000309.002007","CE per FOC",293,2007,309,"Invariata","FOC","Per acquisto e trasporto dell'energia","Per acquisto e trasporto dell'energia","Per acquisto e trasporto dell'energia"]
["000293.000309.002008","CE per FOC",293,2008,309,"Invariata","FOC","Altri costi di materie prime, sussidiarie, di consumo e di merci","Altri costi di materie prime, sussidiarie, di consumo e di merci","Altri costi di materie prime, sussidiarie, di consumo e di merci"]
["000293.000308.000416","CE per FOC",293,416,308,"Invariata","FOC","    7) Per servizi","    7) Per servizi","    7) Per servizi"]
["000293.000416.002003","CE per FOC",293,2003,416,"Invariata","FOC","     Per servizi","     Per servizi","     Per servizi"]
["000293.000308.000511","CE per FOC",293,511,308,"Invariata","FOC","    8) Per godimento beni di terzi","    8) Per godimento beni di terzi","    8) Per godimento beni di terzi"]
["000293.000511.002004","CE per FOC",293,2004,511,"Invariata","FOC","          Per godimento beni di terzi","          Per godimento beni di terzi","          Per godimento beni di terzi"]
["000293.000308.000532","CE per FOC",293,532,308,"Invariata","FOC","    9) Per il personale ","    9) Per il personale ","    9) Per il personale "]
["000293.000532.002005","CE per FOC",293,2005,532,"Invariata","FOC","    Per il personale ","    Per il personale ","    Per il personale "]
["000293.000308.000544","CE per FOC",293,544,308,"Invariata","FOC","    10) Ammortamenti e svalutazioni","    10) Ammortamenti e svalutazioni","    10) Ammortamenti e svalutazioni"]
["000293.000544.000545","CE per FOC",293,545,544,"Invariata","FOC","       Ammortamento delle immobilizzazioni immateriali","       Ammortamento delle immobilizzazioni immateriali","       Ammortamento delle immobilizzazioni immateriali"]
["000293.000544.000547","CE per FOC",293,547,544,"Invariata","FOC","       Ammortamento delle immobilizzazioni materiali (ammortamento tecnicoeconomico)","       Ammortamento delle immobilizzazioni materiali (ammortamento tecnicoeconomico)","       Ammortamento delle immobilizzazioni materiali (ammortamento tecnicoeconomico)"]
["000293.000544.000548","CE per FOC",293,548,544,"Invariata","FOC","       Ammortamento delle immobilizzazioni materiali (ammortamento finanziario)","       Ammortamento delle immobilizzazioni materiali (ammortamento finanziario)","       Ammortamento delle immobilizzazioni materiali (ammortamento finanziario)"]
["000293.000544.000549","CE per FOC",293,549,544,"Invariata","FOC","       Altre svalutazioni delle immobilizzazioni","       Altre svalutazioni delle immobilizzazioni","       Altre svalutazioni delle immobilizzazioni"]
["000293.000544.000550","CE per FOC",293,550,544,"Invariata","FOC","       Svalutazione dei crediti compresi nell'attivo circolante e delle disponibilità","       Svalutazione dei crediti compresi nell'attivo circolante e delle disponibilità","       Svalutazione dei crediti compresi nell'attivo circolante e delle disponibilità"]
["000293.000308.000554","CE per FOC",293,554,308,"Invariata","FOC","    12) Accantonamenti per rischi","    12) Accantonamenti per rischi","    12) Accantonamenti per rischi"]
["000293.000554.001135","CE per FOC",293,1135,554,"Invariata","FOC","          - accantonamenti per rischi ","          - accantonamenti per rischi ","          - accantonamenti per rischi "]
["000293.000308.000558","CE per FOC",293,558,308,"Invariata","FOC","    13) Altri accantonamenti","    13) Altri accantonamenti","    13) Altri accantonamenti"]
["000293.000558.000559","CE per FOC",293,559,558,"Invariata","FOC","       Altri accantonamenti","       Altri accantonamenti","       Altri accantonamenti"]
["000293.000308.000560","CE per FOC",293,560,308,"Invariata","FOC","    14) Oneri diversi di gestione","    14) Oneri diversi di gestione","    14) Oneri diversi di gestione"]
["000293.000560.002006","CE per FOC",293,2006,560,"Invariata","FOC","   Oneri diversi di gestione","   Oneri diversi di gestione","   Oneri diversi di gestione"]
["000293.000308.012515","CE per FOC",293,12515,308,"Invariata","FOC","    14-bis ) oneri non ricorrenti","    14-bis ) oneri non ricorrenti","    14-bis ) oneri non ricorrenti"]
["000293.000000.001142","CE per FOC",293,1142,null,"Invariata","FOC","DIFFERENZA TRA VALORE E COSTI DELLA PRODUZIONE","DIFFERENZA TRA VALORE E COSTI DELLA PRODUZIONE","DIFFERENZA TRA VALORE E COSTI DELLA PRODUZIONE"]
["000293.000000.000603","CE per FOC",293,603,null,"Invariata","FOC","   COSTI INDIRETTI","   COSTI INDIRETTI","   COSTI INDIRETTI"]
["000293.000603.002012","CE per FOC",293,2012,603,"Invariata","FOC","     Acquisto interno di beni e servizi tra funzioni operative condivise","     Acquisto interno di beni e servizi tra funzioni operative condivise","     Acquisto interno di beni e servizi tra funzioni operative condivise"]
["000293.000603.010957","CE per FOC",293,10957,603,{"$f":"IF(TRIM(H1283)=TRIM(I1283),\"Invariata\",IF(H1283=\"\",\"Aggiunta\",IF(I1283=\"\",\"Eliminata\",\"Modificata\")))","v":"Invariata"},"FOC","       Acquisto interno di beni e servizi da altre attività a costo pieno","       Acquisto interno di beni e servizi da altre attività a costo pieno","       Acquisto interno di beni e servizi da altre attività a costo pieno"]
["000293.000000.001143","CE per FOC",293,1143,null,"Invariata","FOC","COSTI DELLA PRODUZIONE (DIRETTI + INDIRETTI)","COSTI DELLA PRODUZIONE (DIRETTI + INDIRETTI)","COSTI DELLA PRODUZIONE (DIRETTI + INDIRETTI)"]
["000293.000000.002009","CE per FOC",293,2009,null,"Invariata","FOC","DIFFERENZA TRA VALORE E COSTI DELLA PRODUZIONE DOPO TRANSAZIONI INTERNE","DIFFERENZA TRA VALORE E COSTI DELLA PRODUZIONE DOPO TRANSAZIONI INTERNE","DIFFERENZA TRA VALORE E COSTI DELLA PRODUZIONE DOPO TRANSAZIONI INTERNE"]
[{"$f":"CONCATENATE(TEXT(C1286,\"000000\"),\".\",TEXT(E1286,\"000000\"),\".\",TEXT(D1286,\"000000\"))","v":"000299.000000.000001"},"CE SC",299,1,null,"Invariata","SC","  A.1) VALORE DELLA PRODUZIONE COMPRENSIVO DELLE VENDITE INTERNE","  A.1) VALORE DELLA PRODUZIONE COMPRENSIVO DELLE VENDITE INTERNE","  A.1) VALORE DELLA PRODUZIONE COMPRENSIVO DELLE VENDITE INTERNE"]
["000299.000001.000002","CE SC",299,2,1,"Invariata","SC","  A) VALORE DELLA PRODUZIONE","  A) VALORE DELLA PRODUZIONE","  A) VALORE DELLA PRODUZIONE"]
["000299.000002.000003","CE SC",299,3,2,"Invariata","SC","    1) Ricavi delle vendite e delle prestazioni","    1) Ricavi delle vendite e delle prestazioni","    1) Ricavi delle vendite e delle prestazioni"]
["000299.000003.001149","CE SC",299,1149,3,"Invariata","SC"," Ricavi dalle vendite e dalle prestazioni"," Ricavi dalle vendite e dalle prestazioni"," Ricavi dalle vendite e dalle prestazioni"]
["000299.000002.000253","CE SC",299,253,2,"Invariata","SC","    2) Variazioni delle rimanenze di prodotti in corso di lavorazione, semilavorati e finiti","    2) Variazioni delle rimanenze di prodotti in corso di lavorazione, semilavorati e finiti","    2) Variazioni delle rimanenze di prodotti in corso di lavorazione, semilavorati e finiti"]
["000299.000253.000254","CE SC",299,254,253,"Invariata","SC","       Variazioni delle rimanenze di prodotti in corso di lavorazione, semilavorati e finiti","       Variazioni delle rimanenze di prodotti in corso di lavorazione, semilavorati e finiti","       Variazioni delle rimanenze di prodotti in corso di lavorazione, semilavorati e finiti"]
["000299.000002.000255","CE SC",299,255,2,"Invariata","SC","    3) Variazioni dei lavori in corso su ordinazioni","    3) Variazioni dei lavori in corso su ordinazioni","    3) Variazioni dei lavori in corso su ordinazioni"]
["000299.000255.000256","CE SC",299,256,255,"Invariata","SC","       Variazioni dei lavori in corso su ordinazione","       Variazioni dei lavori in corso su ordinazione","       Variazioni dei lavori in corso su ordinazione"]
["000299.000002.000257","CE SC",299,257,2,"Invariata","SC","    4) Incrementi di immobilizzazioni per lavori interni ","    4) Incrementi di immobilizzazioni per lavori interni ","    4) Incrementi di immobilizzazioni per lavori interni "]
["000299.000257.002001","CE SC",299,2001,257,"Invariata","SC","  Incrementi di immobilizzazioni per lavori interni ","  Incrementi di immobilizzazioni per lavori interni ","  Incrementi di immobilizzazioni per lavori interni "]
["000299.000002.011466","CE SC",299,11466,2,"Invariata","SC","    5) Altri ricavi e proventi, con separata indicazione dei contributi in conto esercizio","    5) Altri ricavi e proventi, con separata indicazione dei contributi in conto esercizio","    5) Altri ricavi e proventi, con separata indicazione dei contributi in conto esercizio"]
["000299.011466.011457","CE SC",299,11457,11466,"Invariata","SC","   Altri ricavi e proventi","   Altri ricavi e proventi","   Altri ricavi e proventi"]
["000299.000002.012514","CE SC",299,12514,2,"Invariata","SC","    5-bis) ricavi non ricorrenti","    5-bis) ricavi non ricorrenti","    5-bis) ricavi non ricorrenti"]
["000299.000001.000302","CE SC",299,302,1,"Invariata","SC","  VENDITE INTERNE","  VENDITE INTERNE","  VENDITE INTERNE"]
["000299.000302.002011","CE SC",299,2011,302,"Invariata","SC","Vendita interna di beni e servizi tra funzioni operative condivise","Vendita interna di beni e servizi tra funzioni operative condivise","Vendita interna di beni e servizi tra funzioni operative condivise"]
["000299.000000.000307","CE SC",299,307,null,"Invariata","SC","B.1) COSTI DELLA PRODUZIONE COMPRENSIVI DEGLI ACQUISTI INTERNI","B.1) COSTI DELLA PRODUZIONE COMPRENSIVI DEGLI ACQUISTI INTERNI","B.1) COSTI DELLA PRODUZIONE COMPRENSIVI DEGLI ACQUISTI INTERNI"]
["000299.000307.000308","CE SC",299,308,307,"Invariata","SC","  B) COSTI DELLA PRODUZIONE","  B) COSTI DELLA PRODUZIONE","  B) COSTI DELLA PRODUZIONE"]
["000299.000308.000309","CE SC",299,309,308,"Invariata","SC","    6) Per materie prime, sussidiarie, di consumo e di merci (a livello di attività vanno riportati i consumi)","    6) Per materie prime, sussidiarie, di consumo e di merci (a livello di attività vanno riportati i consumi)","    6) Per materie prime, sussidiarie, di consumo e di merci (a livello di attività vanno riportati i consumi)"]
["000299.000309.002007","CE SC",299,2007,309,"Invariata","SC","Per acquisto e trasporto dell'energia","Per acquisto e trasporto dell'energia","Per acquisto e trasporto dell'energia"]
["000299.000309.002008","CE SC",299,2008,309,"Invariata","SC","Altri costi di materie prime, sussidiarie, di consumo e di merci","Altri costi di materie prime, sussidiarie, di consumo e di merci","Altri costi di materie prime, sussidiarie, di consumo e di merci"]
["000299.000308.000416","CE SC",299,416,308,"Invariata","SC","    7) Per servizi","    7) Per servizi","    7) Per servizi"]
["000299.000416.002003","CE SC",299,2003,416,"Invariata","SC","     Per servizi","     Per servizi","     Per servizi"]
["000299.000308.000511","CE SC",299,511,308,"Invariata","SC","    8) Per godimento beni di terzi","    8) Per godimento beni di terzi","    8) Per godimento beni di terzi"]
["000299.000511.002004","CE SC",299,2004,511,"Invariata","SC","          Per godimento beni di terzi","          Per godimento beni di terzi","          Per godimento beni di terzi"]
["000299.000308.000532","CE SC",299,532,308,"Invariata","SC","    9) Per il personale ","    9) Per il personale ","    9) Per il personale "]
["000299.000532.002005","CE SC",299,2005,532,"Invariata","SC","    Per il personale ","    Per il personale ","    Per il personale "]
["000299.000308.000544","CE SC",299,544,308,"Invariata","SC","    10) Ammortamenti e svalutazioni","    10) Ammortamenti e svalutazioni","    10) Ammortamenti e svalutazioni"]
["000299.000544.000545","CE SC",299,545,544,"Invariata","SC","       Ammortamento delle immobilizzazioni immateriali","       Ammortamento delle immobilizzazioni immateriali","       Ammortamento delle immobilizzazioni immateriali"]
["000299.000544.000547","CE SC",299,547,544,"Invariata","SC","       Ammortamento delle immobilizzazioni materiali (ammortamento tecnicoeconomico)","       Ammortamento delle immobilizzazioni materiali (ammortamento tecnicoeconomico)","       Ammortamento delle immobilizzazioni materiali (ammortamento tecnicoeconomico)"]
["000299.000544.000548","CE SC",299,548,544,"Invariata","SC","       Ammortamento delle immobilizzazioni materiali (ammortamento finanziario)","       Ammortamento delle immobilizzazioni materiali (ammortamento finanziario)","       Ammortamento delle immobilizzazioni materiali (ammortamento finanziario)"]
["000299.000544.000549","CE SC",299,549,544,"Invariata","SC","       Altre svalutazioni delle immobilizzazioni","       Altre svalutazioni delle immobilizzazioni","       Altre svalutazioni delle immobilizzazioni"]
["000299.000544.000550","CE SC",299,550,544,"Invariata","SC","       Svalutazione dei crediti compresi nell'attivo circolante e delle disponibilità","       Svalutazione dei crediti compresi nell'attivo circolante e delle disponibilità","       Svalutazione dei crediti compresi nell'attivo circolante e delle disponibilità"]
["000299.000308.000554","CE SC",299,554,308,"Invariata","SC","    12) Accantonamenti per rischi","    12) Accantonamenti per rischi","    12) Accantonamenti per rischi"]
["000299.000554.001135","CE SC",299,1135,554,"Invariata","SC","          - accantonamenti per rischi ","          - accantonamenti per rischi ","          - accantonamenti per rischi "]
["000299.000308.000558","CE SC",299,558,308,"Invariata","SC","    13) Altri accantonamenti","    13) Altri accantonamenti","    13) Altri accantonamenti"]
["000299.000558.000559","CE SC",299,559,558,"Invariata","SC","       Altri accantonamenti","       Altri accantonamenti","       Altri accantonamenti"]
[{"$f":"CONCATENATE(TEXT(C1322,\"000000\"),\".\",TEXT(E1322,\"000000\"),\".\",TEXT(D1322,\"000000\"))","v":"000299.000308.000560"},"CE SC",299,560,308,"Invariata","SC","    14) Oneri diversi di gestione","    14) Oneri diversi di gestione","    14) Oneri diversi di gestione"]
["000299.000560.002006","CE SC",299,2006,560,"Invariata","SC","   Oneri diversi di gestione","   Oneri diversi di gestione","   Oneri diversi di gestione"]
["000299.000308.012515","CE SC",299,12515,308,"Invariata","SC","    14-bis ) oneri non ricorrenti","    14-bis ) oneri non ricorrenti","    14-bis ) oneri non ricorrenti"]
["000299.000000.001142","CE SC",299,1142,null,"Invariata","SC","DIFFERENZA TRA VALORE E COSTI DELLA PRODUZIONE","DIFFERENZA TRA VALORE E COSTI DELLA PRODUZIONE","DIFFERENZA TRA VALORE E COSTI DELLA PRODUZIONE"]
["000299.000000.002009","CE SC",299,2009,null,"Invariata","SC","DIFFERENZA TRA VALORE E COSTI DELLA PRODUZIONE DOPO TRANSAZIONI INTERNE","DIFFERENZA TRA VALORE E COSTI DELLA PRODUZIONE DOPO TRANSAZIONI INTERNE","DIFFERENZA TRA VALORE E COSTI DELLA PRODUZIONE DOPO TRANSAZIONI INTERNE"]
["000277.000001.000002","CE NA",277,2,1,"Invariata","NA","  A) VALORE DELLA PRODUZIONE","  A) VALORE DELLA PRODUZIONE","  A) VALORE DELLA PRODUZIONE"]
["000277.000002.012514","CE NA",277,12514,2,"Invariata","NA","    5-bis) ricavi non ricorrenti","    5-bis) ricavi non ricorrenti","    5-bis) ricavi non ricorrenti"]
["000277.000307.000308","CE NA",277,308,307,"Invariata","NA","  B) COSTI DELLA PRODUZIONE","  B) COSTI DELLA PRODUZIONE","  B) COSTI DELLA PRODUZIONE"]
["000277.000308.000309","CE NA",277,309,308,"Invariata","NA","    6) Per materie prime, sussidiarie, di consumo e di merci (a livello di attività vanno riportati i consumi)","    6) Per materie prime, sussidiarie, di consumo e di merci (a livello di attività vanno riportati i consumi)","    6) Per materie prime, sussidiarie, di consumo e di merci (a livello di attività vanno riportati i consumi)"]
["000277.000309.002007","CE NA",277,2007,309,"Invariata","NA","Per acquisto e trasporto dell'energia","Per acquisto e trasporto dell'energia","Per acquisto e trasporto dell'energia"]
["000277.000309.002008","CE NA",277,2008,309,"Invariata","NA","Altri costi di materie prime, sussidiarie, di consumo e di merci","Altri costi di materie prime, sussidiarie, di consumo e di merci","Altri costi di materie prime, sussidiarie, di consumo e di merci"]
["000277.000308.000552","CE NA",277,552,308,"Invariata","NA","    11) Variazioni Rimanenze di materie prime, sussidiarie, di consumo e merci","    11) Variazioni Rimanenze di materie prime, sussidiarie, di consumo e merci","    11) Variazioni Rimanenze di materie prime, sussidiarie, di consumo e merci"]
["000277.000552.000553","CE NA",277,553,552,"Invariata","NA","      Variazioni Rimanenze di materie prime, sussidiarie, di consumo e merci","      Variazioni Rimanenze di materie prime, sussidiarie, di consumo e merci","      Variazioni Rimanenze di materie prime, sussidiarie, di consumo e merci"]
["000277.000308.012515","CE NA",277,12515,308,"Invariata","NA","    14-bis ) oneri non ricorrenti","    14-bis ) oneri non ricorrenti","    14-bis ) oneri non ricorrenti"]
["000277.000000.001142","CE NA",277,1142,null,"Invariata","NA","DIFFERENZA TRA VALORE E COSTI DELLA PRODUZIONE","DIFFERENZA TRA VALORE E COSTI DELLA PRODUZIONE","DIFFERENZA TRA VALORE E COSTI DELLA PRODUZIONE"]
["000277.000000.000579","CE NA",277,579,null,"Invariata","NA","  C) PROVENTI E ONERI FINANZIARI","  C) PROVENTI E ONERI FINANZIARI","  C) PROVENTI E ONERI FINANZIARI"]
["000277.000579.011467","CE NA",277,11467,579,"Invariata","NA","    15) proventi da partecipazioni, con separata indicazione di quelli relativi ad imprese controllate e collegate e di quelli relativi a controllanti e a imprese sottoposte al controllo di queste ultime","    15) proventi da partecipazioni, con separata indicazione di quelli relativi ad imprese controllate e collegate e di quelli relativi a controllanti e a imprese sottoposte al controllo di queste ultime","    15) proventi da partecipazioni, con separata indicazione di quelli relativi ad imprese controllate e collegate e di quelli relativi a controllanti e a imprese sottoposte al controllo di queste ultime"]
["000277.011467.011470","CE NA",277,11470,11467,"Invariata","NA","         proventi e partecipazioni da imprese controllate","         proventi e partecipazioni da imprese controllate","         proventi e partecipazioni da imprese controllate"]
["000277.011467.011469","CE NA",277,11469,11467,"Invariata","NA","         proventi e partecipazioni da imprese collegate","         proventi e partecipazioni da imprese collegate","         proventi e partecipazioni da imprese collegate"]
["000277.011467.011471","CE NA",277,11471,11467,"Invariata","NA","proventi e partecipazioni da altri","proventi e partecipazioni da altri","proventi e partecipazioni da altri"]
["000277.011467.011468","CE NA",277,11468,11467,"Invariata","NA","       Proventi e partecipazioni da imprese sottoposte al controllo dalle controllanti","       Proventi e partecipazioni da imprese sottoposte al controllo dalle controllanti","       Proventi e partecipazioni da imprese sottoposte al controllo dalle controllanti"]
["000277.000579.000583","CE NA",277,583,579,"Invariata","NA","    16) altri proventi finanziari","    16) altri proventi finanziari","    16) altri proventi finanziari"]
["000277.000583.000584","CE NA",277,584,583,"Invariata","NA","    altri proventi finanziari","    altri proventi finanziari","    altri proventi finanziari"]
["000277.000583.010809","CE NA",277,10809,583,"Invariata","NA","    proventi da contratti finanziari di copertura","    proventi da contratti finanziari di copertura","    proventi da contratti finanziari di copertura"]
["000277.000583.010824","CE NA",277,10824,583,"Invariata","NA","    proventi da contratti finanziari speculativi","    proventi da contratti finanziari speculativi","    proventi da contratti finanziari speculativi"]
["000277.000579.000589","CE NA",277,589,579,{"$f":"IF(TRIM(H1347)=TRIM(I1347),\"Invariata\",IF(H1347=\"\",\"Aggiunta\",IF(I1347=\"\",\"Eliminata\",\"Modificata\")))","v":"Invariata"},"NA","    17-bis) utili e perdite su cambi","    17-bis) utili e perdite su cambi","    17-bis) utili e perdite su cambi"]
["000277.000589.000590","CE NA",277,590,589,"Invariata","NA","utili e perdite sui cambi","utili e perdite sui cambi","utili e perdite sui cambi"]
["000277.000579.011472","CE NA",277,11472,579,"Invariata","NA","        17) interessi e altri oneri finanziari,  con  separata indicazione di quelli verso imprese controllate e collegate e verso controllanti","        17) interessi e altri oneri finanziari,  con  separata indicazione di quelli verso imprese controllate e collegate e verso controllanti","        17) interessi e altri oneri finanziari,  con  separata indicazione di quelli verso imprese controllate e collegate e verso controllanti"]
["000277.011472.011476","CE NA",277,11476,11472,"Invariata","NA","         interessi e altri oneri finanziari da imprese controllate","         interessi e altri oneri finanziari da imprese controllate","         interessi e altri oneri finanziari da imprese controllate"]
["000277.011472.011482","CE NA",277,11482,11472,"Invariata","NA","         interessi e altri oneri finanziari da imprese collegate","         interessi e altri oneri finanziari da imprese collegate","         interessi e altri oneri finanziari da imprese collegate"]
["000277.011472.011483","CE NA",277,11483,11472,"Invariata","NA","         interessi e altri oneri finanziari verso controllanti","         interessi e altri oneri finanziari verso controllanti","         interessi e altri oneri finanziari verso controllanti"]
["000277.011472.011479","CE NA",277,11479,11472,"Invariata","NA","         interessi e altri oneri finanziari verso altri","         interessi e altri oneri finanziari verso altri","         interessi e altri oneri finanziari verso altri"]
["000277.011472.011481","CE NA",277,11481,11472,"Invariata","NA","         perdite su contratti finanziari di copertura","         perdite su contratti finanziari di copertura","         perdite su contratti finanziari di copertura"]
["000277.011472.011484","CE NA",277,11484,11472,"Invariata","NA","         perdite su contratti finanziari speculativi","         perdite su contratti finanziari speculativi","         perdite su contratti finanziari speculativi"]
["000277.011472.011477","CE NA",277,11477,11472,"Invariata","NA","       Altri interessi e oneri finanziari da imprese sottoposte al controllo dalle controllanti","       Altri interessi e oneri finanziari da imprese sottoposte al controllo dalle controllanti","       Altri interessi e oneri finanziari da imprese sottoposte al controllo dalle controllanti"]
["000277.011472.011478","CE NA",277,11478,11472,"Invariata","NA","       Commissioni bancarie comprese anche quelle classificate in B7)","       Commissioni bancarie comprese anche quelle classificate in B7)","       Commissioni bancarie comprese anche quelle classificate in B7)"]
["000277.000000.011537","CE NA",277,11537,null,"Invariata","NA","  D) RETTIFICHE DI VALORE DI ATTIVITÀ E PASSIVITÀ FINANZIARIE","  D) RETTIFICHE DI VALORE DI ATTIVITÀ E PASSIVITÀ FINANZIARIE","  D) RETTIFICHE DI VALORE DI ATTIVITÀ E PASSIVITÀ FINANZIARIE"]
["000277.011537.011538","CE NA",277,11538,11537,"Invariata","NA","    18) rivalutazioni","    18) rivalutazioni","    18) rivalutazioni"]
["000277.011538.011260","CE NA",277,11260,11538,"Invariata","NA","       a) di partecipazioni","       a) di partecipazioni","       a) di partecipazioni"]
["000277.011538.011261","CE NA",277,11261,11538,"Invariata","NA","       b)   di   immobilizzazioni    finanziarie    che    non costituiscono partecipazioni","       b)   di   immobilizzazioni    finanziarie    che    non costituiscono partecipazioni","       b)   di   immobilizzazioni    finanziarie    che    non costituiscono partecipazioni"]
["000277.011538.011262","CE NA",277,11262,11538,"Invariata","NA","       c) di titoli iscritti  all'attivo  circolante  che  non costituiscono partecipazioni","       c) di titoli iscritti  all'attivo  circolante  che  non costituiscono partecipazioni","       c) di titoli iscritti  all'attivo  circolante  che  non costituiscono partecipazioni"]
["000277.011538.011263","CE NA",277,11263,11538,"Invariata","NA","       d) di strumenti finanziari derivati","       d) di strumenti finanziari derivati","       d) di strumenti finanziari derivati"]
["000277.011537.011539","CE NA",277,11539,11537,"Invariata","NA","    19) svalutazioni","    19) svalutazioni","    19) svalutazioni"]
["000277.011539.011264","CE NA",277,11264,11539,"Invariata","NA","       a) di partecipazioni","       a) di partecipazioni","       a) di partecipazioni"]
["000277.011539.011265","CE NA",277,11265,11539,"Invariata","NA","       b)   di   immobilizzazioni    finanziarie    che    non costituiscono partecipazioni","       b)   di   immobilizzazioni    finanziarie    che    non costituiscono partecipazioni","       b)   di   immobilizzazioni    finanziarie    che    non costituiscono partecipazioni"]
["000277.011539.011266","CE NA",277,11266,11539,"Invariata","NA","       c) di titoli iscritti nell'attivo  circolante  che  non costituiscono partecipazioni","       c) di titoli iscritti nell'attivo  circolante  che  non costituiscono partecipazioni","       c) di titoli iscritti nell'attivo  circolante  che  non costituiscono partecipazioni"]
["000277.011539.011267","CE NA",277,11267,11539,"Invariata","NA","       d)  di  strumenti  finanziari  derivati","       d)  di  strumenti  finanziari  derivati","       d)  di  strumenti  finanziari  derivati"]
["000277.000000.000600","CE NA",277,600,null,"Invariata","NA","   RISULTATO PRIMA DELLE IMPOSTE","   RISULTATO PRIMA DELLE IMPOSTE","   RISULTATO PRIMA DELLE IMPOSTE"]
["000277.000000.011535","CE NA",277,11535,null,"Invariata","NA","  20) IMPOSTE SUL REDDITO D'ESERCIZIO, CORRENTI, DIFFERITE E ANTICIPATE","  20) IMPOSTE SUL REDDITO D'ESERCIZIO, CORRENTI, DIFFERITE E ANTICIPATE","  20) IMPOSTE SUL REDDITO D'ESERCIZIO, CORRENTI, DIFFERITE E ANTICIPATE"]
["000277.011535.012529","CE NA",277,12529,11535,"Invariata","NA","       IRES corrente","       IRES corrente","       IRES corrente"]
["000277.011535.012530","CE NA",277,12530,11535,"Invariata","NA","       IRAP corrente","       IRAP corrente","       IRAP corrente"]
["000277.011535.012531","CE NA",277,12531,11535,"Invariata","NA","       Imposte differite e anticipate","       Imposte differite e anticipate","       Imposte differite e anticipate"]
["000277.011535.012532","CE NA",277,12532,11535,"Invariata","NA","       Imposte relative a esercizi precedenti","       Imposte relative a esercizi precedenti","       Imposte relative a esercizi precedenti"]
["000277.011535.012533","CE NA",277,12533,11535,"Invariata","NA","       Altre imposte diverse dalle precedenti","       Altre imposte diverse dalle precedenti","       Altre imposte diverse dalle precedenti"]
["000277.000000.011536","CE NA",277,11536,null,"Invariata","NA","  21) UTILE (PERDITA) DELL'ESERCIZIO","  21) UTILE (PERDITA) DELL'ESERCIZIO","  21) UTILE (PERDITA) DELL'ESERCIZIO"]
["000000.000000.000001","CE Attività VEND EE CF TG CDNV",null,1,null,"Aggiunta","VEND EE CF TG CDNV",null,"  A.1) VALORE DELLA PRODUZIONE COMPRENSIVO DELLE VENDITE INTERNE","  A.1) VALORE DELLA PRODUZIONE COMPRENSIVO DELLE VENDITE INTERNE"]
["000000.000001.000002","CE Attività VEND EE CF TG CDNV",null,2,1,"Aggiunta","VEND EE CF TG CDNV",null,"  A) VALORE DELLA PRODUZIONE","  A) VALORE DELLA PRODUZIONE"]
["000000.000002.000003","CE Attività VEND EE CF TG CDNV",null,3,2,"Aggiunta","VEND EE CF TG CDNV",null,"    1) Ricavi delle vendite e delle prestazioni","    1) Ricavi delle vendite e delle prestazioni"]
["000000.000003.001149","CE Attività VEND EE CF TG CDNV",null,1149,3,"Aggiunta","VEND EE CF TG CDNV",null," Ricavi dalle vendite e dalle prestazioni"," Ricavi dalle vendite e dalle prestazioni"]
["000000.000002.000253","CE Attività VEND EE CF TG CDNV",null,253,2,"Aggiunta","VEND EE CF TG CDNV",null,"    2) Variazioni delle rimanenze di prodotti in corso di lavorazione, semilavorati e finiti","    2) Variazioni delle rimanenze di prodotti in corso di lavorazione, semilavorati e finiti"]
["000000.000253.000254","CE Attività VEND EE CF TG CDNV",null,254,253,"Aggiunta","VEND EE CF TG CDNV",null,"       Variazioni delle rimanenze di prodotti in corso di lavorazione, semilavorati e finiti","       Variazioni delle rimanenze di prodotti in corso di lavorazione, semilavorati e finiti"]
["000000.000002.000255","CE Attività VEND EE CF TG CDNV",null,255,2,"Aggiunta","VEND EE CF TG CDNV",null,"    3) Variazioni dei lavori in corso su ordinazioni","    3) Variazioni dei lavori in corso su ordinazioni"]
["000000.000255.000256","CE Attività VEND EE CF TG CDNV",null,256,255,"Aggiunta","VEND EE CF TG CDNV",null,"       Variazioni dei lavori in corso su ordinazione","       Variazioni dei lavori in corso su ordinazione"]
["000000.000002.000257","CE Attività VEND EE CF TG CDNV",null,257,2,"Aggiunta","VEND EE CF TG CDNV",null,"    4) Incrementi di immobilizzazioni per lavori interni ","    4) Incrementi di immobilizzazioni per lavori interni "]
[{"$f":"CONCATENATE(TEXT(C1386,\"000000\"),\".\",TEXT(E1386,\"000000\"),\".\",TEXT(D1386,\"000000\"))","v":"000000.000257.011039"},"CE Attività VEND EE CF TG CDNV",null,11039,257,"Aggiunta","VEND EE CF TG CDNV",null,"  Incrementi di immobilizzazioni per lavori interni","  Incrementi di immobilizzazioni per lavori interni"]
["000000.000002.011466","CE Attività VEND EE CF TG CDNV",null,11466,2,"Aggiunta","VEND EE CF TG CDNV",null,"    5) Altri ricavi e proventi, con separata indicazione dei contributi in conto esercizio","    5) Altri ricavi e proventi, con separata indicazione dei contributi in conto esercizio"]
["000000.011466.011457","CE Attività VEND EE CF TG CDNV",null,11457,11466,"Aggiunta","VEND EE CF TG CDNV",null,"   Altri ricavi e proventi","   Altri ricavi e proventi"]
["000000.000002.012514","CE Attività VEND EE CF TG CDNV",null,12514,2,"Aggiunta","VEND EE CF TG CDNV",null,"    5-bis) ricavi non ricorrenti","    5-bis) ricavi non ricorrenti"]
["000000.000001.000302","CE Attività VEND EE CF TG CDNV",null,302,1,"Aggiunta","VEND EE CF TG CDNV",null,"  VENDITE INTERNE","  VENDITE INTERNE"]
["000000.000302.000304","CE Attività VEND EE CF TG CDNV",null,304,302,"Aggiunta","VEND EE CF TG CDNV",null,"    Vendita interna di beni e servizi ad altre attività a prezzo di mercato","    Vendita interna di beni e servizi ad altre attività a prezzo di mercato"]
["000000.000302.010968","CE Attività VEND EE CF TG CDNV",null,10968,302,"Aggiunta","VEND EE CF TG CDNV",null,"    Vendita interna di beni e servizi ad altre attività a costo pieno","    Vendita interna di beni e servizi ad altre attività a costo pieno"]
["000000.000000.000307","CE Attività VEND EE CF TG CDNV",null,307,null,"Aggiunta","VEND EE CF TG CDNV",null,"B.1) COSTI DELLA PRODUZIONE COMPRENSIVI DEGLI ACQUISTI INTERNI","B.1) COSTI DELLA PRODUZIONE COMPRENSIVI DEGLI ACQUISTI INTERNI"]
["000000.000307.000308","CE Attività VEND EE CF TG CDNV",null,308,307,"Aggiunta","VEND EE CF TG CDNV",null,"  B) COSTI DELLA PRODUZIONE","  B) COSTI DELLA PRODUZIONE"]
["000000.000308.000309","CE Attività VEND EE CF TG CDNV",null,309,308,"Aggiunta","VEND EE CF TG CDNV",null,"    6) Per materie prime, sussidiarie, di consumo e di merci (a livello di attività vanno riportati i consumi)","    6) Per materie prime, sussidiarie, di consumo e di merci (a livello di attività vanno riportati i consumi)"]
["000000.000309.002007","CE Attività VEND EE CF TG CDNV",null,2007,309,"Aggiunta","VEND EE CF TG CDNV",null,"Per acquisto e trasporto dell'energia","Per acquisto e trasporto dell'energia"]
["000000.000309.002008","CE Attività VEND EE CF TG CDNV",null,2008,309,"Aggiunta","VEND EE CF TG CDNV",null,"Altri costi di materie prime, sussidiarie, di consumo e di merci","Altri costi di materie prime, sussidiarie, di consumo e di merci"]
["000000.000308.000416","CE Attività VEND EE CF TG CDNV",null,416,308,"Aggiunta","VEND EE CF TG CDNV",null,"    7) Per servizi","    7) Per servizi"]
["000000.000416.002003","CE Attività VEND EE CF TG CDNV",null,2003,416,"Aggiunta","VEND EE CF TG CDNV",null,"     Per servizi","     Per servizi"]
["000000.000308.000511","CE Attività VEND EE CF TG CDNV",null,511,308,"Aggiunta","VEND EE CF TG CDNV",null,"    8) Per godimento beni di terzi","    8) Per godimento beni di terzi"]
["000000.000511.002004","CE Attività VEND EE CF TG CDNV",null,2004,511,"Aggiunta","VEND EE CF TG CDNV",null,"          Per godimento beni di terzi","          Per godimento beni di terzi"]
["000000.000308.000532","CE Attività VEND EE CF TG CDNV",null,532,308,"Aggiunta","VEND EE CF TG CDNV",null,"    9) Per il personale ","    9) Per il personale "]
["000000.000532.002005","CE Attività VEND EE CF TG CDNV",null,2005,532,"Aggiunta","VEND EE CF TG CDNV",null,"    Per il personale ","    Per il personale "]
["000000.000308.000544","CE Attività VEND EE CF TG CDNV",null,544,308,"Aggiunta","VEND EE CF TG CDNV",null,"    10) Ammortamenti e svalutazioni","    10) Ammortamenti e svalutazioni"]
["000000.000544.000545","CE Attività VEND EE CF TG CDNV",null,545,544,"Aggiunta","VEND EE CF TG CDNV",null,"       Ammortamento delle immobilizzazioni immateriali","       Ammortamento delle immobilizzazioni immateriali"]
["000000.000544.000547","CE Attività VEND EE CF TG CDNV",null,547,544,"Aggiunta","VEND EE CF TG CDNV",null,"       Ammortamento delle immobilizzazioni materiali (ammortamento tecnicoeconomico)","       Ammortamento delle immobilizzazioni materiali (ammortamento tecnicoeconomico)"]
["000000.000544.000548","CE Attività VEND EE CF TG CDNV",null,548,544,"Aggiunta","VEND EE CF TG CDNV",null,"       Ammortamento delle immobilizzazioni materiali (ammortamento finanziario)","       Ammortamento delle immobilizzazioni materiali (ammortamento finanziario)"]
["000000.000544.000549","CE Attività VEND EE CF TG CDNV",null,549,544,"Aggiunta","VEND EE CF TG CDNV",null,"       Altre svalutazioni delle immobilizzazioni","       Altre svalutazioni delle immobilizzazioni"]
["000000.000544.000550","CE Attività VEND EE CF TG CDNV",null,550,544,"Aggiunta","VEND EE CF TG CDNV",null,"       Svalutazione dei crediti compresi nell'attivo circolante e delle disponibilità","       Svalutazione dei crediti compresi nell'attivo circolante e delle disponibilità"]
["000000.000308.000554","CE Attività VEND EE CF TG CDNV",null,554,308,"Aggiunta","VEND EE CF TG CDNV",null,"    12) Accantonamenti per rischi","    12) Accantonamenti per rischi"]
["000000.000554.001135","CE Attività VEND EE CF TG CDNV",null,1135,554,{"$f":"IF(TRIM(H1411)=TRIM(I1411),\"Invariata\",IF(H1411=\"\",\"Aggiunta\",IF(I1411=\"\",\"Eliminata\",\"Modificata\")))","v":"Aggiunta"},"VEND EE CF TG CDNV",null,"          - accantonamenti per rischi ","          - accantonamenti per rischi "]
["000000.000308.000558","CE Attività VEND EE CF TG CDNV",null,558,308,"Aggiunta","VEND EE CF TG CDNV",null,"    13) Altri accantonamenti","    13) Altri accantonamenti"]
["000000.000558.000559","CE Attività VEND EE CF TG CDNV",null,559,558,"Aggiunta","VEND EE CF TG CDNV",null,"       Altri accantonamenti","       Altri accantonamenti"]
["000000.000308.000560","CE Attività VEND EE CF TG CDNV",null,560,308,"Aggiunta","VEND EE CF TG CDNV",null,"    14) Oneri diversi di gestione","    14) Oneri diversi di gestione"]
["000000.000560.002006","CE Attività VEND EE CF TG CDNV",null,2006,560,"Aggiunta","VEND EE CF TG CDNV",null,"   Oneri diversi di gestione","   Oneri diversi di gestione"]
["000000.000308.012515","CE Attività VEND EE CF TG CDNV",null,12515,308,"Aggiunta","VEND EE CF TG CDNV",null,"    14-bis ) oneri non ricorrenti","    14-bis ) oneri non ricorrenti"]
["000000.000307.000574","CE Attività VEND EE CF TG CDNV",null,574,307,"Aggiunta","VEND EE CF TG CDNV",null,"  ACQUISTI INTERNI","  ACQUISTI INTERNI"]
["000000.000574.010916","CE Attività VEND EE CF TG CDNV",null,10916,574,"Aggiunta","VEND EE CF TG CDNV",null,"       Acquisto interno di beni e servizi da altre attività a prezzo di mercato","       Acquisto interno di beni e servizi da altre attività a prezzo di mercato"]
["000000.000000.001142","CE Attività VEND EE CF TG CDNV",null,1142,null,"Aggiunta","VEND EE CF TG CDNV",null,"DIFFERENZA TRA VALORE E COSTI DELLA PRODUZIONE","DIFFERENZA TRA VALORE E COSTI DELLA PRODUZIONE"]
["000000.000000.000603","CE Attività VEND EE CF TG CDNV",null,603,null,"Aggiunta","VEND EE CF TG CDNV",null,"   COSTI INDIRETTI","   COSTI INDIRETTI"]
["000000.000603.000605","CE Attività VEND EE CF TG CDNV",null,605,603,"Aggiunta","VEND EE CF TG CDNV",null,"       Costi attribuiti dalle funzioni operative condivise","       Costi attribuiti dalle funzioni operative condivise"]
["000000.000605.000608","CE Attività VEND EE CF TG CDNV",null,608,605,"Aggiunta","VEND EE CF TG CDNV",null,"       Funzione operativa condivisa di misura tra attività di settori diversi o tra attività diverse del settore idrico","       Funzione operativa condivisa di misura tra attività di settori diversi o tra attività diverse del settore idrico"]
["000000.000605.000610","CE Attività VEND EE CF TG CDNV",null,610,605,"Aggiunta","VEND EE CF TG CDNV",null,"          Funzione operativa condivisa di cartografia elettronica","          Funzione operativa condivisa di cartografia elettronica"]
["000000.000605.010937","CE Attività VEND EE CF TG CDNV",null,10937,605,"Aggiunta","VEND EE CF TG CDNV",null,"       Funzione operativa condivisa commerciale, di vendita e gestione clientela del settore elettrico","       Funzione operativa condivisa commerciale, di vendita e gestione clientela del settore elettrico"]
["000000.000605.010938","CE Attività VEND EE CF TG CDNV",null,10938,605,"Aggiunta","VEND EE CF TG CDNV",null,"       Funzione operativa condivisa commerciale, di vendita e gestione clientela del settore gas","       Funzione operativa condivisa commerciale, di vendita e gestione clientela del settore gas"]
["000000.000605.010939","CE Attività VEND EE CF TG CDNV",null,10939,605,"Aggiunta","VEND EE CF TG CDNV",null,"       Funzione operativa condivisa commerciale, di vendita e gestione clientela comune al settore elettrico e gas","       Funzione operativa condivisa commerciale, di vendita e gestione clientela comune al settore elettrico e gas"]
["000000.000605.010940","CE Attività VEND EE CF TG CDNV",null,10940,605,"Aggiunta","VEND EE CF TG CDNV",null,"       Funzione operativa condivisa di acquisto di energia elettrica","       Funzione operativa condivisa di acquisto di energia elettrica"]
["000000.000605.010941","CE Attività VEND EE CF TG CDNV",null,10941,605,"Aggiunta","VEND EE CF TG CDNV",null,"       Funzione operativa condivisa di acquisto di gas","       Funzione operativa condivisa di acquisto di gas"]
["000000.000605.010942","CE Attività VEND EE CF TG CDNV",null,10942,605,"Aggiunta","VEND EE CF TG CDNV",null,"       Funzione operativa condivisa di acquisto comune di energia elettrica e di gas","       Funzione operativa condivisa di acquisto comune di energia elettrica e di gas"]
["000000.000605.011512","CE Attività VEND EE CF TG CDNV",null,11512,605,"Aggiunta","VEND EE CF TG CDNV",null,"       Funzione operativa condivisa di verifica e controllo","       Funzione operativa condivisa di verifica e controllo"]
["000000.000605.011517","CE Attività VEND EE CF TG CDNV",null,11517,605,"Aggiunta","VEND EE CF TG CDNV",null,"       Funzione operativa condivisa di telecontrollo e ricerca perdite","       Funzione operativa condivisa di telecontrollo e ricerca perdite"]
["000000.000605.011521","CE Attività VEND EE CF TG CDNV",null,11521,605,"Aggiunta","VEND EE CF TG CDNV",null,"       Funzione operativa condivisa di manutenzione e servizi tecnici","       Funzione operativa condivisa di manutenzione e servizi tecnici"]
["000000.000603.000612","CE Attività VEND EE CF TG CDNV",null,612,603,"Aggiunta","VEND EE CF TG CDNV",null,"       Costi attribuiti dai servizi comuni","       Costi attribuiti dai servizi comuni"]
["000000.000612.002010","CE Attività VEND EE CF TG CDNV",null,2010,612,"Aggiunta","VEND EE CF TG CDNV",null,"          Costi attribuiti dai servizi comuni","          Costi attribuiti dai servizi comuni"]
["000000.000603.010957","CE Attività VEND EE CF TG CDNV",null,10957,603,"Aggiunta","VEND EE CF TG CDNV",null,"       Acquisto interno di beni e servizi da altre attività a costo pieno","       Acquisto interno di beni e servizi da altre attività a costo pieno"]
["000000.000000.000001","CE Attività VEN F GAS STV",null,1,null,"Aggiunta","VEN F GAS STV",null,"  A.1) VALORE DELLA PRODUZIONE COMPRENSIVO DELLE VENDITE INTERNE","  A.1) VALORE DELLA PRODUZIONE COMPRENSIVO DELLE VENDITE INTERNE"]
["000000.000001.000002","CE Attività VEN F GAS STV",null,2,1,"Aggiunta","VEN F GAS STV",null,"  A) VALORE DELLA PRODUZIONE","  A) VALORE DELLA PRODUZIONE"]
["000000.000002.000003","CE Attività VEN F GAS STV",null,3,2,"Aggiunta","VEN F GAS STV",null,"    1) Ricavi delle vendite e delle prestazioni","    1) Ricavi delle vendite e delle prestazioni"]
["000000.000003.001149","CE Attività VEN F GAS STV",null,1149,3,"Aggiunta","VEN F GAS STV",null," Ricavi dalle vendite e dalle prestazioni"," Ricavi dalle vendite e dalle prestazioni"]
["000000.000002.000253","CE Attività VEN F GAS STV",null,253,2,"Aggiunta","VEN F GAS STV",null,"    2) Variazioni delle rimanenze di prodotti in corso di lavorazione, semilavorati e finiti","    2) Variazioni delle rimanenze di prodotti in corso di lavorazione, semilavorati e finiti"]
["000000.000253.000254","CE Attività VEN F GAS STV",null,254,253,"Aggiunta","VEN F GAS STV",null,"       Variazioni delle rimanenze di prodotti in corso di lavorazione, semilavorati e finiti","       Variazioni delle rimanenze di prodotti in corso di lavorazione, semilavorati e finiti"]
["000000.000002.000255","CE Attività VEN F GAS STV",null,255,2,"Aggiunta","VEN F GAS STV",null,"    3) Variazioni dei lavori in corso su ordinazioni","    3) Variazioni dei lavori in corso su ordinazioni"]
["000000.000255.000256","CE Attività VEN F GAS STV",null,256,255,"Aggiunta","VEN F GAS STV",null,"       Variazioni dei lavori in corso su ordinazione","       Variazioni dei lavori in corso su ordinazione"]
["000000.000002.000257","CE Attività VEN F GAS STV",null,257,2,"Aggiunta","VEN F GAS STV",null,"    4) Incrementi di immobilizzazioni per lavori interni ","    4) Incrementi di immobilizzazioni per lavori interni "]
["000000.000257.011039","CE Attività VEN F GAS STV",null,11039,257,"Aggiunta","VEN F GAS STV",null,"  Incrementi di immobilizzazioni per lavori interni","  Incrementi di immobilizzazioni per lavori interni"]
["000000.000002.011466","CE Attività VEN F GAS STV",null,11466,2,"Aggiunta","VEN F GAS STV",null,"    5) Altri ricavi e proventi, con separata indicazione dei contributi in conto esercizio","    5) Altri ricavi e proventi, con separata indicazione dei contributi in conto esercizio"]
["000000.011466.011457","CE Attività VEN F GAS STV",null,11457,11466,"Aggiunta","VEN F GAS STV",null,"   Altri ricavi e proventi","   Altri ricavi e proventi"]
["000000.000002.012514","CE Attività VEN F GAS STV",null,12514,2,"Aggiunta","VEN F GAS STV",null,"    5-bis) ricavi non ricorrenti","    5-bis) ricavi non ricorrenti"]
["000000.000001.000302","CE Attività VEN F GAS STV",null,302,1,"Aggiunta","VEN F GAS STV",null,"  VENDITE INTERNE","  VENDITE INTERNE"]
[{"$f":"CONCATENATE(TEXT(C1450,\"000000\"),\".\",TEXT(E1450,\"000000\"),\".\",TEXT(D1450,\"000000\"))","v":"000000.000302.000304"},"CE Attività VEN F GAS STV",null,304,302,"Aggiunta","VEN F GAS STV",null,"    Vendita interna di beni e servizi ad altre attività a prezzo di mercato","    Vendita interna di beni e servizi ad altre attività a prezzo di mercato"]
["000000.000302.010968","CE Attività VEN F GAS STV",null,10968,302,"Aggiunta","VEN F GAS STV",null,"    Vendita interna di beni e servizi ad altre attività a costo pieno","    Vendita interna di beni e servizi ad altre attività a costo pieno"]
["000000.000000.000307","CE Attività VEN F GAS STV",null,307,null,"Aggiunta","VEN F GAS STV",null,"B.1) COSTI DELLA PRODUZIONE COMPRENSIVI DEGLI ACQUISTI INTERNI","B.1) COSTI DELLA PRODUZIONE COMPRENSIVI DEGLI ACQUISTI INTERNI"]
["000000.000307.000308","CE Attività VEN F GAS STV",null,308,307,"Aggiunta","VEN F GAS STV",null,"  B) COSTI DELLA PRODUZIONE","  B) COSTI DELLA PRODUZIONE"]
["000000.000308.000309","CE Attività VEN F GAS STV",null,309,308,"Aggiunta","VEN F GAS STV",null,"    6) Per materie prime, sussidiarie, di consumo e di merci (a livello di attività vanno riportati i consumi)","    6) Per materie prime, sussidiarie, di consumo e di merci (a livello di attività vanno riportati i consumi)"]
["000000.000309.002007","CE Attività VEN F GAS STV",null,2007,309,"Aggiunta","VEN F GAS STV",null,"Per acquisto e trasporto dell'energia","Per acquisto e trasporto dell'energia"]
["000000.000309.002008","CE Attività VEN F GAS STV",null,2008,309,"Aggiunta","VEN F GAS STV",null,"Altri costi di materie prime, sussidiarie, di consumo e di merci","Altri costi di materie prime, sussidiarie, di consumo e di merci"]
["000000.000308.000416","CE Attività VEN F GAS STV",null,416,308,"Aggiunta","VEN F GAS STV",null,"    7) Per servizi","    7) Per servizi"]
["000000.000416.002003","CE Attività VEN F GAS STV",null,2003,416,"Aggiunta","VEN F GAS STV",null,"     Per servizi","     Per servizi"]
["000000.000308.000511","CE Attività VEN F GAS STV",null,511,308,"Aggiunta","VEN F GAS STV",null,"    8) Per godimento beni di terzi","    8) Per godimento beni di terzi"]
["000000.000511.002004","CE Attività VEN F GAS STV",null,2004,511,"Aggiunta","VEN F GAS STV",null,"          Per godimento beni di terzi","          Per godimento beni di terzi"]
["000000.000308.000532","CE Attività VEN F GAS STV",null,532,308,"Aggiunta","VEN F GAS STV",null,"    9) Per il personale ","    9) Per il personale "]
["000000.000532.002005","CE Attività VEN F GAS STV",null,2005,532,"Aggiunta","VEN F GAS STV",null,"    Per il personale ","    Per il personale "]
["000000.000308.000544","CE Attività VEN F GAS STV",null,544,308,"Aggiunta","VEN F GAS STV",null,"    10) Ammortamenti e svalutazioni","    10) Ammortamenti e svalutazioni"]
["000000.000544.000545","CE Attività VEN F GAS STV",null,545,544,"Aggiunta","VEN F GAS STV",null,"       Ammortamento delle immobilizzazioni immateriali","       Ammortamento delle immobilizzazioni immateriali"]
["000000.000544.000547","CE Attività VEN F GAS STV",null,547,544,"Aggiunta","VEN F GAS STV",null,"       Ammortamento delle immobilizzazioni materiali (ammortamento tecnicoeconomico)","       Ammortamento delle immobilizzazioni materiali (ammortamento tecnicoeconomico)"]
["000000.000544.000548","CE Attività VEN F GAS STV",null,548,544,"Aggiunta","VEN F GAS STV",null,"       Ammortamento delle immobilizzazioni materiali (ammortamento finanziario)","       Ammortamento delle immobilizzazioni materiali (ammortamento finanziario)"]
["000000.000544.000549","CE Attività VEN F GAS STV",null,549,544,"Aggiunta","VEN F GAS STV",null,"       Altre svalutazioni delle immobilizzazioni","       Altre svalutazioni delle immobilizzazioni"]
["000000.000544.000550","CE Attività VEN F GAS STV",null,550,544,"Aggiunta","VEN F GAS STV",null,"       Svalutazione dei crediti compresi nell'attivo circolante e delle disponibilità","       Svalutazione dei crediti compresi nell'attivo circolante e delle disponibilità"]
["000000.000308.000554","CE Attività VEN F GAS STV",null,554,308,"Aggiunta","VEN F GAS STV",null,"    12) Accantonamenti per rischi","    12) Accantonamenti per rischi"]
["000000.000554.001135","CE Attività VEN F GAS STV",null,1135,554,"Aggiunta","VEN F GAS STV",null,"          - accantonamenti per rischi ","          - accantonamenti per rischi "]
["000000.000308.000558","CE Attività VEN F GAS STV",null,558,308,"Aggiunta","VEN F GAS STV",null,"    13) Altri accantonamenti","    13) Altri accantonamenti"]
["000000.000558.000559","CE Attività VEN F GAS STV",null,559,558,"Aggiunta","VEN F GAS STV",null,"       Altri accantonamenti","       Altri accantonamenti"]
["000000.000308.000560","CE Attività VEN F GAS STV",null,560,308,"Aggiunta","VEN F GAS STV",null,"    14) Oneri diversi di gestione","    14) Oneri diversi di gestione"]
["000000.000560.002006","CE Attività VEN F GAS STV",null,2006,560,"Aggiunta","VEN F GAS STV",null,"   Oneri diversi di gestione","   Oneri diversi di gestione"]
["000000.000308.012515","CE Attività VEN F GAS STV",null,12515,308,{"$f":"IF(TRIM(H1475)=TRIM(I1475),\"Invariata\",IF(H1475=\"\",\"Aggiunta\",IF(I1475=\"\",\"Eliminata\",\"Modificata\")))","v":"Aggiunta"},"VEN F GAS STV",null,"    14-bis ) oneri non ricorrenti","    14-bis ) oneri non ricorrenti"]
["000000.000307.000574","CE Attività VEN F GAS STV",null,574,307,"Aggiunta","VEN F GAS STV",null,"  ACQUISTI INTERNI","  ACQUISTI INTERNI"]
["000000.000574.010916","CE Attività VEN F GAS STV",null,10916,574,"Aggiunta","VEN F GAS STV",null,"       Acquisto interno di beni e servizi da altre attività a prezzo di mercato","       Acquisto interno di beni e servizi da altre attività a prezzo di mercato"]
["000000.000000.001142","CE Attività VEN F GAS STV",null,1142,null,"Aggiunta","VEN F GAS STV",null,"DIFFERENZA TRA VALORE E COSTI DELLA PRODUZIONE","DIFFERENZA TRA VALORE E COSTI DELLA PRODUZIONE"]
["000000.000000.000603","CE Attività VEN F GAS STV",null,603,null,"Aggiunta","VEN F GAS STV",null,"   COSTI INDIRETTI","   COSTI INDIRETTI"]
["000000.000603.000605","CE Attività VEN F GAS STV",null,605,603,"Aggiunta","VEN F GAS STV",null,"       Costi attribuiti dalle funzioni operative condivise","       Costi attribuiti dalle funzioni operative condivise"]
["000000.000605.000608","CE Attività VEN F GAS STV",null,608,605,"Aggiunta","VEN F GAS STV",null,"       Funzione operativa condivisa di misura tra attività di settori diversi o tra attività diverse del settore idrico","       Funzione operativa condivisa di misura tra attività di settori diversi o tra attività diverse del settore idrico"]
["000000.000605.000610","CE Attività VEN F GAS STV",null,610,605,"Aggiunta","VEN F GAS STV",null,"          Funzione operativa condivisa di cartografia elettronica","          Funzione operativa condivisa di cartografia elettronica"]
["000000.000605.010937","CE Attività VEN F GAS STV",null,10937,605,"Aggiunta","VEN F GAS STV",null,"       Funzione operativa condivisa commerciale, di vendita e gestione clientela del settore elettrico","       Funzione operativa condivisa commerciale, di vendita e gestione clientela del settore elettrico"]
["000000.000605.010938","CE Attività VEN F GAS STV",null,10938,605,"Aggiunta","VEN F GAS STV",null,"       Funzione operativa condivisa commerciale, di vendita e gestione clientela del settore gas","       Funzione operativa condivisa commerciale, di vendita e gestione clientela del settore gas"]
["000000.000605.010939","CE Attività VEN F GAS STV",null,10939,605,"Aggiunta","VEN F GAS STV",null,"       Funzione operativa condivisa commerciale, di vendita e gestione clientela comune al settore elettrico e gas","       Funzione operativa condivisa commerciale, di vendita e gestione clientela comune al settore elettrico e gas"]
["000000.000605.010940","CE Attività VEN F GAS STV",null,10940,605,"Aggiunta","VEN F GAS STV",null,"       Funzione operativa condivisa di acquisto di energia elettrica","       Funzione operativa condivisa di acquisto di energia elettrica"]
["000000.000605.010941","CE Attività VEN F GAS STV",null,10941,605,"Aggiunta","VEN F GAS STV",null,"       Funzione operativa condivisa di acquisto di gas","       Funzione operativa condivisa di acquisto di gas"]
["000000.000605.010942","CE Attività VEN F GAS STV",null,10942,605,"Aggiunta","VEN F GAS STV",null,"       Funzione operativa condivisa di acquisto comune di energia elettrica e di gas","       Funzione operativa condivisa di acquisto comune di energia elettrica e di gas"]
["000000.000605.011512","CE Attività VEN F GAS STV",null,11512,605,"Aggiunta","VEN F GAS STV",null,"       Funzione operativa condivisa di verifica e controllo","       Funzione operativa condivisa di verifica e controllo"]
["000000.000605.011517","CE Attività VEN F GAS STV",null,11517,605,"Aggiunta","VEN F GAS STV",null,"       Funzione operativa condivisa di telecontrollo e ricerca perdite","       Funzione operativa condivisa di telecontrollo e ricerca perdite"]
["000000.000605.011521","CE Attività VEN F GAS STV",null,11521,605,"Aggiunta","VEN F GAS STV",null,"       Funzione operativa condivisa di manutenzione e servizi tecnici","       Funzione operativa condivisa di manutenzione e servizi tecnici"]
["000000.000603.000612","CE Attività VEN F GAS STV",null,612,603,"Aggiunta","VEN F GAS STV",null,"       Costi attribuiti dai servizi comuni","       Costi attribuiti dai servizi comuni"]
["000000.000612.002010","CE Attività VEN F GAS STV",null,2010,612,"Aggiunta","VEN F GAS STV",null,"          Costi attribuiti dai servizi comuni","          Costi attribuiti dai servizi comuni"]
["000000.000603.010957","CE Attività VEN F GAS STV",null,10957,603,"Aggiunta","VEN F GAS STV",null,"       Acquisto interno di beni e servizi da altre attività a costo pieno","       Acquisto interno di beni e servizi da altre attività a costo pieno"]

{"sheet":"Stato Patrimoniale","index":1,"n_rows":1,"n_cols":10,"rows_kept":1}
["Indice","Prospetto old","ID prospetto","ID voce","ID voce padre","Modifica","Prospetto","Voce 2023","Voce 2024","Voce 2025"]

{"sheet":"Grandezze Tecnico-Fisiche","index":2,"n_rows":297,"n_cols":13,"rows_kept":297}
["Indice","Prospetto old","ID prospetto","ID voce","ID voce padre","Modifica","Prospetto","Voce 2024","Unità di misura 2024","Voce 2025","Unità di misura 2025","Voce 2026","Unità di misura 2026"]
[{"$f":"CONCATENATE(TEXT(C2,\"000000\"),\".\",TEXT(E2,\"000000\"),\".\",TEXT(D2,\"000000\"))","v":"000337.000000.000964"},"Grandezze tecnico fisiche per attività PROD EE",337,964,null,{"$f":"IF(AND(H2=J2,I2=K2),\"Invariata\",IF(H2=\"\",\"Aggiunta\",IF(J2=\"\",\"Eliminata\",\"Modificata\")))","v":"Invariata"},"PROD EE","Forza lavoro a fine esercizio","Num. lavoratori","Forza lavoro a fine esercizio","Num. lavoratori","Forza lavoro a fine esercizio","Num. lavoratori"]
[{"$f":"CONCATENATE(TEXT(C3,\"000000\"),\".\",TEXT(E3,\"000000\"),\".\",TEXT(D3,\"000000\"))","v":"000337.000000.000952"},"Grandezze tecnico fisiche per attività PROD EE",337,952,null,{"$f":"IF(AND(H3=J3,I3=K3),\"Invariata\",IF(H3=\"\",\"Aggiunta\",IF(J3=\"\",\"Eliminata\",\"Modificata\")))","v":"Invariata"},"PROD EE","Produzione annua lorda","GWh","Produzione annua lorda","GWh","Produzione annua lorda","GWh"]
["000337.000000.000953","Grandezze tecnico fisiche per attività PROD EE",337,953,null,"Invariata","PROD EE","Energia venduta al GME","GWh","Energia venduta al GME","GWh","Energia venduta al GME","GWh"]
["000337.000000.000954","Grandezze tecnico fisiche per attività PROD EE",337,954,null,"Invariata","PROD EE","Energia venduta al GSE","GWh","Energia venduta al GSE","GWh","Energia venduta al GSE","GWh"]
["000337.000000.000955","Grandezze tecnico fisiche per attività PROD EE",337,955,null,"Invariata","PROD EE","Energia venduta a TERNA","GWh","Energia venduta a TERNA","GWh","Energia venduta a TERNA","GWh"]
["000337.000000.000963","Grandezze tecnico fisiche per attività PROD EE",337,963,null,"Invariata","PROD EE","Forza lavoro media annua","Num. lavoratori","Forza lavoro media annua","Num. lavoratori","Forza lavoro media annua","Num. lavoratori"]
["000337.000000.010580","Grandezze tecnico fisiche per attività PROD EE",337,10580,null,"Invariata","PROD EE","Energia termica venduta","GWh","Energia termica venduta","GWh","Energia termica venduta","GWh"]
["000337.000000.010594","Grandezze tecnico fisiche per attività PROD EE",337,10594,null,"Invariata","PROD EE","Produzione annua netta","GWh","Produzione annua netta","GWh","Produzione annua netta","GWh"]
["000337.000000.011116","Grandezze tecnico fisiche per attività PROD EE",337,11116,null,"Invariata","PROD EE","Energia venduta a clienti terzi","GWh","Energia venduta a clienti terzi","GWh","Energia venduta a clienti terzi","GWh"]
["000337.000000.011115","Grandezze tecnico fisiche per attività PROD EE",337,11115,null,"Invariata","PROD EE","Energia venduta ad altre imprese del gruppo","GWh","Energia venduta ad altre imprese del gruppo","GWh","Energia venduta ad altre imprese del gruppo","GWh"]
["000326.000000.000964","Grandezze tecnico fisiche per attività DIST EE",326,964,null,"Invariata","DIST EE","Forza lavoro a fine esercizio","Num. lavoratori","Forza lavoro a fine esercizio","Num. lavoratori","Forza lavoro a fine esercizio","Num. lavoratori"]
["000326.000000.000963","Grandezze tecnico fisiche per attività DIST EE",326,963,null,"Invariata","DIST EE","Forza lavoro media annua","Num. lavoratori","Forza lavoro media annua","Num. lavoratori","Forza lavoro media annua","Num. lavoratori"]
["000326.000000.010621","Grandezze tecnico fisiche per attività DIST EE",326,10621,null,"Invariata","DIST EE","Numero cabine di trasformazione AT/AT","Num.","Numero cabine di trasformazione AT/AT","Num.","Numero cabine di trasformazione AT/AT","Num."]
["000326.000000.010622","Grandezze tecnico fisiche per attività DIST EE",326,10622,null,"Invariata","DIST EE","Numero cabine di trasformazione AT/MT","Num.","Numero cabine di trasformazione AT/MT","Num.","Numero cabine di trasformazione AT/MT","Num."]
["000326.000000.010623","Grandezze tecnico fisiche per attività DIST EE",326,10623,null,"Invariata","DIST EE","Numero cabine di trasformazione MT/BT","Num.","Numero cabine di trasformazione MT/BT","Num.","Numero cabine di trasformazione MT/BT","Num."]
["000326.000000.001005","Grandezze tecnico fisiche per attività DIST EE",326,1005,null,"Invariata","DIST EE"," Linee in AT","km"," Linee in AT","km"," Linee in AT","km"]
["000326.000000.001006","Grandezze tecnico fisiche per attività DIST EE",326,1006,null,"Invariata","DIST EE"," Linee in MT","km"," Linee in MT","km"," Linee in MT","km"]
["000326.000000.001007","Grandezze tecnico fisiche per attività DIST EE",326,1007,null,"Invariata","DIST EE"," Linee in BT","km"," Linee in BT","km"," Linee in BT","km"]
["000326.000000.001008","Grandezze tecnico fisiche per attività DIST EE",326,1008,null,"Invariata","DIST EE","Potenza di trasformazione in AT/MT","MVA","Potenza di trasformazione in AT/MT","MVA","Potenza di trasformazione in AT/MT","MVA"]
["000326.000000.001009","Grandezze tecnico fisiche per attività DIST EE",326,1009,null,"Invariata","DIST EE","Potenza di trasformazione in MT/BT","MVA","Potenza di trasformazione in MT/BT","MVA","Potenza di trasformazione in MT/BT","MVA"]
["000326.000000.010550","Grandezze tecnico fisiche per attività DIST EE",326,10550,null,"Invariata","DIST EE","Potenza di trasformazione AT/AT","MVA","Potenza di trasformazione AT/AT","MVA","Potenza di trasformazione AT/AT","MVA"]
["000326.000000.011057","Grandezze tecnico fisiche per attività DIST EE",326,11057,null,"Invariata","DIST EE","Numero di trasformatori AT/MT","Num.","Numero di trasformatori AT/MT","Num.","Numero di trasformatori AT/MT","Num."]
["000326.000000.011056","Grandezze tecnico fisiche per attività DIST EE",326,11056,null,"Invariata","DIST EE","Numero di trasformatori AT/AT","Num.","Numero di trasformatori AT/AT","Num.","Numero di trasformatori AT/AT","Num."]
["000326.000000.011054","Grandezze tecnico fisiche per attività DIST EE",326,11054,null,"Invariata","DIST EE","Punti di prelievo in MT  (medi annui)","Num.","Punti di prelievo in MT  (medi annui)","Num.","Punti di prelievo in MT  (medi annui)","Num."]
["000326.000000.011051","Grandezze tecnico fisiche per attività DIST EE",326,11051,null,"Invariata","DIST EE","Energia distribuita in BT","GWh","Energia distribuita in BT","GWh","Energia distribuita in BT","GWh"]
["000326.000000.011049","Grandezze tecnico fisiche per attività DIST EE",326,11049,null,"Invariata","DIST EE","Energia distribuita in AT","GWh","Energia distribuita in AT","GWh","Energia distribuita in AT","GWh"]
["000326.000000.011048","Grandezze tecnico fisiche per attività DIST EE",326,11048,null,"Invariata","DIST EE","Energia distribuita in AAT","GWh","Energia distribuita in AAT","GWh","Energia distribuita in AAT","GWh"]
["000326.000000.011050","Grandezze tecnico fisiche per attività DIST EE",326,11050,null,"Invariata","DIST EE","Energia distribuita in MT","GWh","Energia distribuita in MT","GWh","Energia distribuita in MT","GWh"]
["000326.000000.011052","Grandezze tecnico fisiche per attività DIST EE",326,11052,null,"Invariata","DIST EE","Punti di prelievo in AAT (medi annui)","Num.","Punti di prelievo in AAT (medi annui)","Num.","Punti di prelievo in AAT (medi annui)","Num."]
["000326.000000.011058","Grandezze tecnico fisiche per attività DIST EE",326,11058,null,"Invariata","DIST EE","Numero di trasformatori MT/BT","Num.","Numero di trasformatori MT/BT","Num.","Numero di trasformatori MT/BT","Num."]
["000326.000000.011053","Grandezze tecnico fisiche per attività DIST EE",326,11053,null,"Invariata","DIST EE","Punti di prelievo in AT (medi annui)","Num.","Punti di prelievo in AT (medi annui)","Num.","Punti di prelievo in AT (medi annui)","Num."]
["000326.000000.011055","Grandezze tecnico fisiche per attività DIST EE",326,11055,null,"Invariata","DIST EE","Punti di prelievo in BT (medi annui)","Num.","Punti di prelievo in BT (medi annui)","Num.","Punti di prelievo in BT (medi annui)","Num."]
["000327.000000.000964","Grandezze tecnico fisiche per attività MIS EE",327,964,null,"Invariata","MIS EE","Forza lavoro a fine esercizio","Num. lavoratori","Forza lavoro a fine esercizio","Num. lavoratori","Forza lavoro a fine esercizio","Num. lavoratori"]
["000327.000000.000963","Grandezze tecnico fisiche per attività MIS EE",327,963,null,"Invariata","MIS EE","Forza lavoro media annua","Num. lavoratori","Forza lavoro media annua","Num. lavoratori","Forza lavoro media annua","Num. lavoratori"]
["000327.000000.010655","Grandezze tecnico fisiche per attività MIS EE",327,10655,null,"Invariata","MIS EE","Punti di prelievo non misurati (medi annui)","Num.","Punti di prelievo non misurati (medi annui)","Num.","Punti di prelievo non misurati (medi annui)","Num."]
["000327.000000.001011","Grandezze tecnico fisiche per attività MIS EE",327,1011,null,"Invariata","MIS EE","Misuratori elettronici BT - conforme ai requisiti di cui alla delibera Num. 292/06 (media annua)","Num.","Misuratori elettronici BT - conforme ai requisiti di cui alla delibera Num. 292/06 (media annua)","Num.","Misuratori elettronici BT - conforme ai requisiti di cui alla delibera Num. 292/06 (media annua)","Num."]
["000327.000000.001012","Grandezze tecnico fisiche per attività MIS EE",327,1012,null,"Invariata","MIS EE","Misuratori elettromeccanici/tradizionali BT (media annua)","Num.","Misuratori elettromeccanici/tradizionali BT (media annua)","Num.","Misuratori elettromeccanici/tradizionali BT (media annua)","Num."]
["000327.000000.012115","Grandezze tecnico fisiche per attività MIS EE",327,12115,null,"Invariata","MIS EE","Misuratori elettronici BT - conforme ai requisiti di cui alla delibera 87/2016/R/eel","Num.","Misuratori elettronici BT - conforme ai requisiti di cui alla delibera 87/2016/R/eel","Num.","Misuratori elettronici BT - conforme ai requisiti di cui alla delibera 87/2016/R/eel","Num."]
["000327.000000.010632","Grandezze tecnico fisiche per attività MIS EE",327,10632,null,"Invariata","MIS EE","Punti di interconnessione RTN/distribuzione (medi annui)","Num.","Punti di interconnessione RTN/distribuzione (medi annui)","Num.","Punti di interconnessione RTN/distribuzione (medi annui)","Num."]
["000327.000000.010672","Grandezze tecnico fisiche per attività MIS EE",327,10672,null,"Invariata","MIS EE","Punti di interconnessione distributore/distributore (medi annui)","Num.","Punti di interconnessione distributore/distributore (medi annui)","Num.","Punti di interconnessione distributore/distributore (medi annui)","Num."]
["000327.000000.011068","Grandezze tecnico fisiche per attività MIS EE",327,11068,null,"Invariata","MIS EE","     di cui punti di prelievo e immissione in MT (medi annui)","Num.","     di cui punti di prelievo e immissione in MT (medi annui)","Num.","     di cui punti di prelievo e immissione in MT (medi annui)","Num."]
["000327.000000.011065","Grandezze tecnico fisiche per attività MIS EE",327,11065,null,"Invariata","MIS EE","     di cui punti di prelievo e immissione in AT (medi annui)","Num.","     di cui punti di prelievo e immissione in AT (medi annui)","Num.","     di cui punti di prelievo e immissione in AT (medi annui)","Num."]
["000327.000000.011071","Grandezze tecnico fisiche per attività MIS EE",327,11071,null,"Invariata","MIS EE","     di cui punti di prelievo e immissione in BT (medi annui)","Num.","     di cui punti di prelievo e immissione in BT (medi annui)","Num.","     di cui punti di prelievo e immissione in BT (medi annui)","Num."]
["000327.000000.012130","Grandezze tecnico fisiche per attività MIS EE",327,12130,null,"Invariata","MIS EE","Punti di misura di generazione (medi annui):","Num.","Punti di misura di generazione (medi annui):","Num.","Punti di misura di generazione (medi annui):","Num."]
["000327.012130.012131","Grandezze tecnico fisiche per attività MIS EE",327,12131,12130,"Invariata","MIS EE","  di cui in AAT (medi annui)","Num.","  di cui in AAT (medi annui)","Num.","  di cui in AAT (medi annui)","Num."]
["000327.012130.012132","Grandezze tecnico fisiche per attività MIS EE",327,12132,12130,"Invariata","MIS EE","  di cui in AT (medi annui)","Num.","  di cui in AT (medi annui)","Num.","  di cui in AT (medi annui)","Num."]
["000327.012130.012133","Grandezze tecnico fisiche per attività MIS EE",327,12133,12130,"Invariata","MIS EE","  di cui in MT (medi annui)","Num.","  di cui in MT (medi annui)","Num.","  di cui in MT (medi annui)","Num."]
["000327.012130.012134","Grandezze tecnico fisiche per attività MIS EE",327,12134,12130,"Invariata","MIS EE","  di cui in BT (medi annui)","Num.","  di cui in BT (medi annui)","Num.","  di cui in BT (medi annui)","Num."]
["000327.000000.012135","Grandezze tecnico fisiche per attività MIS EE",327,12135,null,"Invariata","MIS EE","Punti di misura di consumo (medi annui):","Num.","Punti di misura di consumo (medi annui):","Num.","Punti di misura di consumo (medi annui):","Num."]
["000327.012135.012136","Grandezze tecnico fisiche per attività MIS EE",327,12136,12135,"Invariata","MIS EE","  di cui in AAT (medi annui)","Num.","  di cui in AAT (medi annui)","Num.","  di cui in AAT (medi annui)","Num."]
["000327.012135.012137","Grandezze tecnico fisiche per attività MIS EE",327,12137,12135,"Invariata","MIS EE","  di cui in AT (medi annui)","Num.","  di cui in AT (medi annui)","Num.","  di cui in AT (medi annui)","Num."]
["000327.012135.012138","Grandezze tecnico fisiche per attività MIS EE",327,12138,12135,"Invariata","MIS EE","  di cui in MT (medi annui)","Num.","  di cui in MT (medi annui)","Num.","  di cui in MT (medi annui)","Num."]
["000327.012135.012139","Grandezze tecnico fisiche per attività MIS EE",327,12139,12135,"Invariata","MIS EE","  di cui in BT (medi annui)","Num.","  di cui in BT (medi annui)","Num.","  di cui in BT (medi annui)","Num."]
["000327.000000.012140","Grandezze tecnico fisiche per attività MIS EE",327,12140,null,"Invariata","MIS EE","Punti di misura di connessione (medi annui): ","Num.","Punti di misura di connessione (medi annui): ","Num.","Punti di misura di connessione (medi annui): ","Num."]
["000327.012140.012141","Grandezze tecnico fisiche per attività MIS EE",327,12141,12140,"Invariata","MIS EE","  di cui in AAT (medi annui)","Num.","  di cui in AAT (medi annui)","Num.","  di cui in AAT (medi annui)","Num."]
["000327.012140.012142","Grandezze tecnico fisiche per attività MIS EE",327,12142,12140,"Invariata","MIS EE","  di cui in AT (medi annui)","Num.","  di cui in AT (medi annui)","Num.","  di cui in AT (medi annui)","Num."]
["000327.012140.012143","Grandezze tecnico fisiche per attività MIS EE",327,12143,12140,"Invariata","MIS EE","  di cui in MT (medi annui)","Num.","  di cui in MT (medi annui)","Num.","  di cui in MT (medi annui)","Num."]
["000327.012140.012144","Grandezze tecnico fisiche per attività MIS EE",327,12144,12140,"Invariata","MIS EE","  di cui in BT (medi annui)","Num.","  di cui in BT (medi annui)","Num.","  di cui in BT (medi annui)","Num."]
["000338.000000.000964","Grandezze tecnico fisiche per attività VEND I EE",338,964,null,"Invariata","VEND I EE","Forza lavoro a fine esercizio","Num. lavoratori","Forza lavoro a fine esercizio","Num. lavoratori","Forza lavoro a fine esercizio","Num. lavoratori"]
["000338.000000.000963","Grandezze tecnico fisiche per attività VEND I EE",338,963,null,"Invariata","VEND I EE","Forza lavoro media annua","Num. lavoratori","Forza lavoro media annua","Num. lavoratori","Forza lavoro media annua","Num. lavoratori"]
["000338.000000.000957","Grandezze tecnico fisiche per attività VEND I EE",338,957,null,"Invariata","VEND I EE","Energia venduta a clienti esteri terzi tramite contratti bilaterali","GWh","Energia venduta a clienti esteri terzi tramite contratti bilaterali","GWh","Energia venduta a clienti esteri terzi tramite contratti bilaterali","GWh"]
["000338.000000.000958","Grandezze tecnico fisiche per attività VEND I EE",338,958,null,"Invariata","VEND I EE","Energia venduta a clienti esteri facenti parte di imprese del gruppo tramite contratti bilaterali","GWh","Energia venduta a clienti esteri facenti parte di imprese del gruppo tramite contratti bilaterali","GWh","Energia venduta a clienti esteri facenti parte di imprese del gruppo tramite contratti bilaterali","GWh"]
["000338.000000.000959","Grandezze tecnico fisiche per attività VEND I EE",338,959,null,"Invariata","VEND I EE","Energia venduta a clienti nazionali terzi tramite contratti bilaterali","GWh","Energia venduta a clienti nazionali terzi tramite contratti bilaterali","GWh","Energia venduta a clienti nazionali terzi tramite contratti bilaterali","GWh"]
["000338.000000.000960","Grandezze tecnico fisiche per attività VEND I EE",338,960,null,"Invariata","VEND I EE","Energia venduta a clienti nazionali facenti parte di imprese del gruppo tramite contratti bilaterali","GWh","Energia venduta a clienti nazionali facenti parte di imprese del gruppo tramite contratti bilaterali","GWh","Energia venduta a clienti nazionali facenti parte di imprese del gruppo tramite contratti bilaterali","GWh"]
["000338.000000.001020","Grandezze tecnico fisiche per attività VEND I EE",338,1020,null,"Invariata","VEND I EE","Energia venduta al GME","GWh","Energia venduta al GME","GWh","Energia venduta al GME","GWh"]
[{"$f":"CONCATENATE(TEXT(C67,\"000000\"),\".\",TEXT(E67,\"000000\"),\".\",TEXT(D67,\"000000\"))","v":"000338.000000.010524"},"Grandezze tecnico fisiche per attività VEND I EE",338,10524,null,{"$f":"IF(AND(H67=J67,I67=K67),\"Invariata\",IF(H67=\"\",\"Aggiunta\",IF(J67=\"\",\"Eliminata\",\"Modificata\")))","v":"Invariata"},"VEND I EE","Energia acquistata all'estero destinata in Italia tramite contratti bilaterali","GWh","Energia acquistata all'estero destinata in Italia tramite contratti bilaterali","GWh","Energia acquistata all'estero destinata in Italia tramite contratti bilaterali","GWh"]
["000338.000000.010532","Grandezze tecnico fisiche per attività VEND I EE",338,10532,null,"Invariata","VEND I EE","Energia acquistata dal GME","GWh","Energia acquistata dal GME","GWh","Energia acquistata dal GME","GWh"]
["000338.000000.010534","Grandezze tecnico fisiche per attività VEND I EE",338,10534,null,"Invariata","VEND I EE","Energia acquistata in Italia da imprese del gruppo","GWh","Energia acquistata in Italia da imprese del gruppo","GWh","Energia acquistata in Italia da imprese del gruppo","GWh"]
["000338.000000.010628","Grandezze tecnico fisiche per attività VEND I EE",338,10628,null,"Invariata","VEND I EE","Energia acquistata in Italia da altre imprese NON del gruppo","GWh","Energia acquistata in Italia da altre imprese NON del gruppo","GWh","Energia acquistata in Italia da altre imprese NON del gruppo","GWh"]
["000338.000000.010535","Grandezze tecnico fisiche per attività VEND I EE",338,10535,null,"Invariata","VEND I EE","Energia acquistata con contratti differenziali dal GSE","GWh","Energia acquistata con contratti differenziali dal GSE","GWh","Energia acquistata con contratti differenziali dal GSE","GWh"]
["000338.000000.010543","Grandezze tecnico fisiche per attività VEND I EE",338,10543,null,"Invariata","VEND I EE","Energia acquistata in Italia da imprese terze tramite contratti bilaterali","GWh","Energia acquistata in Italia da imprese terze tramite contratti bilaterali","GWh","Energia acquistata in Italia da imprese terze tramite contratti bilaterali","GWh"]
["000338.000000.010565","Grandezze tecnico fisiche per attività VEND I EE",338,10565,null,"Invariata","VEND I EE","Energia venduta all'Acquirente Unico","GWh","Energia venduta all'Acquirente Unico","GWh","Energia venduta all'Acquirente Unico","GWh"]
["000338.000000.010586","Grandezze tecnico fisiche per attività VEND I EE",338,10586,null,"Invariata","VEND I EE","Energia ceduta con contratti differenziali al GSE","GWh","Energia ceduta con contratti differenziali al GSE","GWh","Energia ceduta con contratti differenziali al GSE","GWh"]
["000338.000000.010666","Grandezze tecnico fisiche per attività VEND I EE",338,10666,null,"Invariata","VEND I EE","Volumi di energia acquistata nell'anno oggetto di copertura tramite contratti finanziari","GWh","Volumi di energia acquistata nell'anno oggetto di copertura tramite contratti finanziari","GWh","Volumi di energia acquistata nell'anno oggetto di copertura tramite contratti finanziari","GWh"]
["000338.000000.010674","Grandezze tecnico fisiche per attività VEND I EE",338,10674,null,"Invariata","VEND I EE","Volumi di energia venduta nell'anno oggetto di copertura tramite contratti finanziari","GWh","Volumi di energia venduta nell'anno oggetto di copertura tramite contratti finanziari","GWh","Volumi di energia venduta nell'anno oggetto di copertura tramite contratti finanziari","GWh"]
["100666.000000.000964","Grandezze tecnico fisiche per attività VEND CL LIB EE",100666,964,null,"Invariata","VEND CL LIB EE","Forza lavoro a fine esercizio","Num. lavoratori","Forza lavoro a fine esercizio","Num. lavoratori","Forza lavoro a fine esercizio","Num. lavoratori"]
["100666.000000.000963","Grandezze tecnico fisiche per attività VEND CL LIB EE",100666,963,null,"Invariata","VEND CL LIB EE","Forza lavoro media annua","Num. lavoratori","Forza lavoro media annua","Num. lavoratori","Forza lavoro media annua","Num. lavoratori"]
["100666.000000.010620","Grandezze tecnico fisiche per attività VEND CL LIB EE",100666,10620,null,"Invariata","VEND CL LIB EE","Punti di prelievo medi annui relativi a clienti non domestici - Altissima tensione","Num.","Punti di prelievo medi annui relativi a clienti non domestici - Altissima tensione","Num.","Punti di prelievo medi annui relativi a clienti non domestici - Altissima tensione","Num."]
["100666.000000.001028","Grandezze tecnico fisiche per attività VEND CL LIB EE",100666,1028,null,"Invariata","VEND CL LIB EE","Punti di prelievo medi annui relativi a clienti domestici","Num.","Punti di prelievo medi annui relativi a clienti domestici","Num.","Punti di prelievo medi annui relativi a clienti domestici","Num."]
["100666.000000.001029","Grandezze tecnico fisiche per attività VEND CL LIB EE",100666,1029,null,"Invariata","VEND CL LIB EE","Punti di prelievo medi annui relativi a clienti non domestici - BT altri usi","Num.","Punti di prelievo medi annui relativi a clienti non domestici - BT altri usi","Num.","Punti di prelievo medi annui relativi a clienti non domestici - BT altri usi","Num."]
["100666.000000.001030","Grandezze tecnico fisiche per attività VEND CL LIB EE",100666,1030,null,"Invariata","VEND CL LIB EE","Punti di prelievo medi annui relativi a clienti non domestici - BT ILLUMINAZIONE PUBBLICA","Num.","Punti di prelievo medi annui relativi a clienti non domestici - BT ILLUMINAZIONE PUBBLICA","Num.","Punti di prelievo medi annui relativi a clienti non domestici - BT ILLUMINAZIONE PUBBLICA","Num."]
["100666.000000.001031","Grandezze tecnico fisiche per attività VEND CL LIB EE",100666,1031,null,"Invariata","VEND CL LIB EE","Punti di prelievo medi annui relativi a clienti non domestici - MT altri usi","Num.","Punti di prelievo medi annui relativi a clienti non domestici - MT altri usi","Num.","Punti di prelievo medi annui relativi a clienti non domestici - MT altri usi","Num."]
["100666.000000.001032","Grandezze tecnico fisiche per attività VEND CL LIB EE",100666,1032,null,"Invariata","VEND CL LIB EE","Punti di prelievo medi annui relativi a clienti non domestici - MT ILLUMINAZIONE PUBBLICA","Num.","Punti di prelievo medi annui relativi a clienti non domestici - MT ILLUMINAZIONE PUBBLICA","Num.","Punti di prelievo medi annui relativi a clienti non domestici - MT ILLUMINAZIONE PUBBLICA","Num."]
["100666.000000.001033","Grandezze tecnico fisiche per attività VEND CL LIB EE",100666,1033,null,"Invariata","VEND CL LIB EE","Punti di prelievo medi annui relativi a clienti non domestici - AT","Num.","Punti di prelievo medi annui relativi a clienti non domestici - AT","Num.","Punti di prelievo medi annui relativi a clienti non domestici - AT","Num."]
["100666.000000.010521","Grandezze tecnico fisiche per attività VEND CL LIB EE",100666,10521,null,"Invariata","VEND CL LIB EE","Energia venduta a clienti non domestici - MT altri usi","MWh","Energia venduta a clienti non domestici - MT altri usi","MWh","Energia venduta a clienti non domestici - MT altri usi","MWh"]
["100666.000000.010528","Grandezze tecnico fisiche per attività VEND CL LIB EE",100666,10528,null,"Invariata","VEND CL LIB EE","Energia venduta a clienti non domestici - AT","MWh","Energia venduta a clienti non domestici - AT","MWh","Energia venduta a clienti non domestici - AT","MWh"]
["100666.000000.010529","Grandezze tecnico fisiche per attività VEND CL LIB EE",100666,10529,null,"Invariata","VEND CL LIB EE","Energia venduta a clienti non domestici - Altissima tensione","MWh","Energia venduta a clienti non domestici - Altissima tensione","MWh","Energia venduta a clienti non domestici - Altissima tensione","MWh"]
["100666.000000.010547","Grandezze tecnico fisiche per attività VEND CL LIB EE",100666,10547,null,"Invariata","VEND CL LIB EE","Energia venduta a clienti non domestici - BT altri usi","MWh","Energia venduta a clienti non domestici - BT altri usi","MWh","Energia venduta a clienti non domestici - BT altri usi","MWh"]
["100666.000000.010579","Grandezze tecnico fisiche per attività VEND CL LIB EE",100666,10579,null,"Invariata","VEND CL LIB EE","Energia venduta a clienti domestici","MWh","Energia venduta a clienti domestici","MWh","Energia venduta a clienti domestici","MWh"]
["100666.000000.010584","Grandezze tecnico fisiche per attività VEND CL LIB EE",100666,10584,null,"Invariata","VEND CL LIB EE","Energia venduta a clienti non domestici - MT Illuminazione pubblica","MWh","Energia venduta a clienti non domestici - MT Illuminazione pubblica","MWh","Energia venduta a clienti non domestici - MT Illuminazione pubblica","MWh"]
["100666.000000.010592","Grandezze tecnico fisiche per attività VEND CL LIB EE",100666,10592,null,"Invariata","VEND CL LIB EE","Energia venduta a clienti non domestici - BT Illuminazione pubblica","MWh","Energia venduta a clienti non domestici - BT Illuminazione pubblica","MWh","Energia venduta a clienti non domestici - BT Illuminazione pubblica","MWh"]
["100666.000000.012120","Grandezze tecnico fisiche per attività VEND CL LIB EE",100666,12120,null,"Invariata","VEND CL LIB EE","Clienti serviti nel cratere del sisma","Num.","Clienti serviti nel cratere del sisma","Num.","Clienti serviti nel cratere del sisma","Num."]
["100666.000000.012121","Grandezze tecnico fisiche per attività VEND CL LIB EE",100666,12121,null,"Invariata","VEND CL LIB EE","Vendite nel cratere del sisma","MWh","Vendite nel cratere del sisma","MWh","Vendite nel cratere del sisma","MWh"]
["100056.000000.000964","Grandezze tecnico fisiche per attività VEND EE CF SG",100056,964,null,"Invariata","VEND EE CF SG","Forza lavoro a fine esercizio","Num. lavoratori","Forza lavoro a fine esercizio","Num. lavoratori","Forza lavoro a fine esercizio","Num. lavoratori"]
["100102.000000.000964","Grandezze tecnico fisiche per attività VEND EE CF MT",100102,964,null,"Invariata","VEND EE CF MT","Forza lavoro a fine esercizio","Num. lavoratori","Forza lavoro a fine esercizio","Num. lavoratori","Forza lavoro a fine esercizio","Num. lavoratori"]
["100056.000000.000963","Grandezze tecnico fisiche per attività VEND EE CF SG",100056,963,null,"Invariata","VEND EE CF SG","Forza lavoro media annua","Num. lavoratori","Forza lavoro media annua","Num. lavoratori","Forza lavoro media annua","Num. lavoratori"]
["100102.000000.000963","Grandezze tecnico fisiche per attività VEND EE CF MT",100102,963,null,"Invariata","VEND EE CF MT","Forza lavoro media annua","Num. lavoratori","Forza lavoro media annua","Num. lavoratori","Forza lavoro media annua","Num. lavoratori"]
["100056.000000.010620","Grandezze tecnico fisiche per attività VEND EE CF SG",100056,10620,null,"Invariata","VEND EE CF SG","Punti di prelievo medi annui relativi a clienti non domestici - Altissima tensione","Num.","Punti di prelievo medi annui relativi a clienti non domestici - Altissima tensione","Num.","Punti di prelievo medi annui relativi a clienti non domestici - Altissima tensione","Num."]
["100102.000000.010620","Grandezze tecnico fisiche per attività VEND EE CF MT",100102,10620,null,"Invariata","VEND EE CF MT","Punti di prelievo medi annui relativi a clienti non domestici - Altissima tensione","Num.","Punti di prelievo medi annui relativi a clienti non domestici - Altissima tensione","Num.","Punti di prelievo medi annui relativi a clienti non domestici - Altissima tensione","Num."]
["100102.000000.001028","Grandezze tecnico fisiche per attività VEND EE CF MT",100102,1028,null,"Invariata","VEND EE CF MT","Punti di prelievo medi annui relativi a clienti domestici","Num.","Punti di prelievo medi annui relativi a clienti domestici","Num.","Punti di prelievo medi annui relativi a clienti domestici","Num."]
["100056.000000.001028","Grandezze tecnico fisiche per attività VEND EE CF SG",100056,1028,null,"Invariata","VEND EE CF SG","Punti di prelievo medi annui relativi a clienti domestici","Num.","Punti di prelievo medi annui relativi a clienti domestici","Num.","Punti di prelievo medi annui relativi a clienti domestici","Num."]
["100102.000000.001029","Grandezze tecnico fisiche per attività VEND EE CF MT",100102,1029,null,"Invariata","VEND EE CF MT","Punti di prelievo medi annui relativi a clienti non domestici - BT altri usi","Num.","Punti di prelievo medi annui relativi a clienti non domestici - BT altri usi","Num.","Punti di prelievo medi annui relativi a clienti non domestici - BT altri usi","Num."]
["100056.000000.001029","Grandezze tecnico fisiche per attività VEND EE CF SG",100056,1029,null,"Invariata","VEND EE CF SG","Punti di prelievo medi annui relativi a clienti non domestici - BT altri usi","Num.","Punti di prelievo medi annui relativi a clienti non domestici - BT altri usi","Num.","Punti di prelievo medi annui relativi a clienti non domestici - BT altri usi","Num."]
["100102.000000.001030","Grandezze tecnico fisiche per attività VEND EE CF MT",100102,1030,null,"Invariata","VEND EE CF MT","Punti di prelievo medi annui relativi a clienti non domestici - BT ILLUMINAZIONE PUBBLICA","Num.","Punti di prelievo medi annui relativi a clienti non domestici - BT ILLUMINAZIONE PUBBLICA","Num.","Punti di prelievo medi annui relativi a clienti non domestici - BT ILLUMINAZIONE PUBBLICA","Num."]
["100056.000000.001030","Grandezze tecnico fisiche per attività VEND EE CF SG",100056,1030,null,"Invariata","VEND EE CF SG","Punti di prelievo medi annui relativi a clienti non domestici - BT ILLUMINAZIONE PUBBLICA","Num.","Punti di prelievo medi annui relativi a clienti non domestici - BT ILLUMINAZIONE PUBBLICA","Num.","Punti di prelievo medi annui relativi a clienti non domestici - BT ILLUMINAZIONE PUBBLICA","Num."]
["100102.000000.001031","Grandezze tecnico fisiche per attività VEND EE CF MT",100102,1031,null,"Invariata","VEND EE CF MT","Punti di prelievo medi annui relativi a clienti non domestici - MT altri usi","Num.","Punti di prelievo medi annui relativi a clienti non domestici - MT altri usi","Num.","Punti di prelievo medi annui relativi a clienti non domestici - MT altri usi","Num."]
["100056.000000.001031","Grandezze tecnico fisiche per attività VEND EE CF SG",100056,1031,null,"Invariata","VEND EE CF SG","Punti di prelievo medi annui relativi a clienti non domestici - MT altri usi","Num.","Punti di prelievo medi annui relativi a clienti non domestici - MT altri usi","Num.","Punti di prelievo medi annui relativi a clienti non domestici - MT altri usi","Num."]
["100102.000000.001032","Grandezze tecnico fisiche per attività VEND EE CF MT",100102,1032,null,"Invariata","VEND EE CF MT","Punti di prelievo medi annui relativi a clienti non domestici - MT ILLUMINAZIONE PUBBLICA","Num.","Punti di prelievo medi annui relativi a clienti non domestici - MT ILLUMINAZIONE PUBBLICA","Num.","Punti di prelievo medi annui relativi a clienti non domestici - MT ILLUMINAZIONE PUBBLICA","Num."]
["100056.000000.001032","Grandezze tecnico fisiche per attività VEND EE CF SG",100056,1032,null,"Invariata","VEND EE CF SG","Punti di prelievo medi annui relativi a clienti non domestici - MT ILLUMINAZIONE PUBBLICA","Num.","Punti di prelievo medi annui relativi a clienti non domestici - MT ILLUMINAZIONE PUBBLICA","Num.","Punti di prelievo medi annui relativi a clienti non domestici - MT ILLUMINAZIONE PUBBLICA","Num."]
["100102.000000.001033","Grandezze tecnico fisiche per attività VEND EE CF MT",100102,1033,null,"Invariata","VEND EE CF MT","Punti di prelievo medi annui relativi a clienti non domestici - AT","Num.","Punti di prelievo medi annui relativi a clienti non domestici - AT","Num.","Punti di prelievo medi annui relativi a clienti non domestici - AT","Num."]
["100056.000000.001033","Grandezze tecnico fisiche per attività VEND EE CF SG",100056,1033,null,"Invariata","VEND EE CF SG","Punti di prelievo medi annui relativi a clienti non domestici - AT","Num.","Punti di prelievo medi annui relativi a clienti non domestici - AT","Num.","Punti di prelievo medi annui relativi a clienti non domestici - AT","Num."]
["100102.000000.010521","Grandezze tecnico fisiche per attività VEND EE CF MT",100102,10521,null,"Invariata","VEND EE CF MT","Energia venduta a clienti non domestici - MT altri usi","MWh","Energia venduta a clienti non domestici - MT altri usi","MWh","Energia venduta a clienti non domestici - MT altri usi","MWh"]
["100056.000000.010521","Grandezze tecnico fisiche per attività VEND EE CF SG",100056,10521,null,"Invariata","VEND EE CF SG","Energia venduta a clienti non domestici - MT altri usi","MWh","Energia venduta a clienti non domestici - MT altri usi","MWh","Energia venduta a clienti non domestici - MT altri usi","MWh"]
["100056.000000.010528","Grandezze tecnico fisiche per attività VEND EE CF SG",100056,10528,null,"Invariata","VEND EE CF SG","Energia venduta a clienti non domestici - AT","MWh","Energia venduta a clienti non domestici - AT","MWh","Energia venduta a clienti non domestici - AT","MWh"]
["100102.000000.010528","Grandezze tecnico fisiche per attività VEND EE CF MT",100102,10528,null,"Invariata","VEND EE CF MT","Energia venduta a clienti non domestici - AT","MWh","Energia venduta a clienti non domestici - AT","MWh","Energia venduta a clienti non domestici - AT","MWh"]
["100056.000000.010529","Grandezze tecnico fisiche per attività VEND EE CF SG",100056,10529,null,"Invariata","VEND EE CF SG","Energia venduta a clienti non domestici - Altissima tensione","MWh","Energia venduta a clienti non domestici - Altissima tensione","MWh","Energia venduta a clienti non domestici - Altissima tensione","MWh"]
["100102.000000.010529","Grandezze tecnico fisiche per attività VEND EE CF MT",100102,10529,null,"Invariata","VEND EE CF MT","Energia venduta a clienti non domestici - Altissima tensione","MWh","Energia venduta a clienti non domestici - Altissima tensione","MWh","Energia venduta a clienti non domestici - Altissima tensione","MWh"]
["100102.000000.010547","Grandezze tecnico fisiche per attività VEND EE CF MT",100102,10547,null,"Invariata","VEND EE CF MT","Energia venduta a clienti non domestici - BT altri usi","MWh","Energia venduta a clienti non domestici - BT altri usi","MWh","Energia venduta a clienti non domestici - BT altri usi","MWh"]
["100056.000000.010547","Grandezze tecnico fisiche per attività VEND EE CF SG",100056,10547,null,"Invariata","VEND EE CF SG","Energia venduta a clienti non domestici - BT altri usi","MWh","Energia venduta a clienti non domestici - BT altri usi","MWh","Energia venduta a clienti non domestici - BT altri usi","MWh"]
["100102.000000.010579","Grandezze tecnico fisiche per attività VEND EE CF MT",100102,10579,null,"Invariata","VEND EE CF MT","Energia venduta a clienti domestici","MWh","Energia venduta a clienti domestici","MWh","Energia venduta a clienti domestici","MWh"]
["100056.000000.010579","Grandezze tecnico fisiche per attività VEND EE CF SG",100056,10579,null,"Invariata","VEND EE CF SG","Energia venduta a clienti domestici","MWh","Energia venduta a clienti domestici","MWh","Energia venduta a clienti domestici","MWh"]
["100056.000000.010584","Grandezze tecnico fisiche per attività VEND EE CF SG",100056,10584,null,"Invariata","VEND EE CF SG","Energia venduta a clienti non domestici - MT Illuminazione pubblica","MWh","Energia venduta a clienti non domestici - MT Illuminazione pubblica","MWh","Energia venduta a clienti non domestici - MT Illuminazione pubblica","MWh"]
["100102.000000.010584","Grandezze tecnico fisiche per attività VEND EE CF MT",100102,10584,null,"Invariata","VEND EE CF MT","Energia venduta a clienti non domestici - MT Illuminazione pubblica","MWh","Energia venduta a clienti non domestici - MT Illuminazione pubblica","MWh","Energia venduta a clienti non domestici - MT Illuminazione pubblica","MWh"]
["100102.000000.010592","Grandezze tecnico fisiche per attività VEND EE CF MT",100102,10592,null,"Invariata","VEND EE CF MT","Energia venduta a clienti non domestici - BT Illuminazione pubblica","MWh","Energia venduta a clienti non domestici - BT Illuminazione pubblica","MWh","Energia venduta a clienti non domestici - BT Illuminazione pubblica","MWh"]
["100056.000000.010592","Grandezze tecnico fisiche per attività VEND EE CF SG",100056,10592,null,"Invariata","VEND EE CF SG","Energia venduta a clienti non domestici - BT Illuminazione pubblica","MWh","Energia venduta a clienti non domestici - BT Illuminazione pubblica","MWh","Energia venduta a clienti non domestici - BT Illuminazione pubblica","MWh"]
["100102.000000.012120","Grandezze tecnico fisiche per attività VEND EE CF MT",100102,12120,null,"Invariata","VEND EE CF MT","Clienti serviti nel cratere del sisma","Num.","Clienti serviti nel cratere del sisma","Num.","Clienti serviti nel cratere del sisma","Num."]
["100056.000000.012120","Grandezze tecnico fisiche per attività VEND EE CF SG",100056,12120,null,"Invariata","VEND EE CF SG","Clienti serviti nel cratere del sisma","Num.","Clienti serviti nel cratere del sisma","Num.","Clienti serviti nel cratere del sisma","Num."]
["100056.000000.012121","Grandezze tecnico fisiche per attività VEND EE CF SG",100056,12121,null,"Invariata","VEND EE CF SG","Vendite nel cratere del sisma","MWh","Vendite nel cratere del sisma","MWh","Vendite nel cratere del sisma","MWh"]
["100102.000000.012121","Grandezze tecnico fisiche per attività VEND EE CF MT",100102,12121,null,"Invariata","VEND EE CF MT","Vendite nel cratere del sisma","MWh","Vendite nel cratere del sisma","MWh","Vendite nel cratere del sisma","MWh"]
[{"$f":"CONCATENATE(TEXT(C131,\"000000\"),\".\",TEXT(E131,\"000000\"),\".\",TEXT(D131,\"000000\"))","v":"102912.000000.000964"},"Grandezze tecnico fisiche per attività VEND EE CF TG",102912,964,null,{"$f":"IF(AND(H131=J131,I131=K131),\"Invariata\",IF(H131=\"\",\"Aggiunta\",IF(J131=\"\",\"Eliminata\",\"Modificata\")))","v":"Eliminata"},"VEND EE CF TG","Forza lavoro a fine esercizio","Num. lavoratori"]
["102912.000000.000963","Grandezze tecnico fisiche per attività VEND EE CF TG",102912,963,null,"Eliminata","VEND EE CF TG","Forza lavoro media annua","Num. lavoratori"]
["102912.000000.010620","Grandezze tecnico fisiche per attività VEND EE CF TG",102912,10620,null,"Eliminata","VEND EE CF TG","Punti di prelievo medi annui relativi a clienti non domestici - Altissima tensione","Num."]
["102912.000000.001028","Grandezze tecnico fisiche per attività VEND EE CF TG",102912,1028,null,"Eliminata","VEND EE CF TG","Punti di prelievo medi annui relativi a clienti domestici","Num."]
["102912.000000.001029","Grandezze tecnico fisiche per attività VEND EE CF TG",102912,1029,null,"Eliminata","VEND EE CF TG","Punti di prelievo medi annui relativi a clienti non domestici - BT altri usi","Num."]
["102912.000000.001030","Grandezze tecnico fisiche per attività VEND EE CF TG",102912,1030,null,"Eliminata","VEND EE CF TG","Punti di prelievo medi annui relativi a clienti non domestici - BT ILLUMINAZIONE PUBBLICA","Num."]
["102912.000000.001031","Grandezze tecnico fisiche per attività VEND EE CF TG",102912,1031,null,"Eliminata","VEND EE CF TG","Punti di prelievo medi annui relativi a clienti non domestici - MT altri usi","Num."]
["102912.000000.001032","Grandezze tecnico fisiche per attività VEND EE CF TG",102912,1032,null,"Eliminata","VEND EE CF TG","Punti di prelievo medi annui relativi a clienti non domestici - MT ILLUMINAZIONE PUBBLICA","Num."]
["102912.000000.001033","Grandezze tecnico fisiche per attività VEND EE CF TG",102912,1033,null,"Eliminata","VEND EE CF TG","Punti di prelievo medi annui relativi a clienti non domestici - AT","Num."]
["102912.000000.010521","Grandezze tecnico fisiche per attività VEND EE CF TG",102912,10521,null,"Eliminata","VEND EE CF TG","Energia venduta a clienti non domestici - MT altri usi","MWh"]
["102912.000000.010528","Grandezze tecnico fisiche per attività VEND EE CF TG",102912,10528,null,"Eliminata","VEND EE CF TG","Energia venduta a clienti non domestici - AT","MWh"]
["102912.000000.010529","Grandezze tecnico fisiche per attività VEND EE CF TG",102912,10529,null,"Eliminata","VEND EE CF TG","Energia venduta a clienti non domestici - Altissima tensione","MWh"]
["102912.000000.010547","Grandezze tecnico fisiche per attività VEND EE CF TG",102912,10547,null,"Eliminata","VEND EE CF TG","Energia venduta a clienti non domestici - BT altri usi","MWh"]
["102912.000000.010579","Grandezze tecnico fisiche per attività VEND EE CF TG",102912,10579,null,"Eliminata","VEND EE CF TG","Energia venduta a clienti domestici","MWh"]
["102912.000000.010584","Grandezze tecnico fisiche per attività VEND EE CF TG",102912,10584,null,"Eliminata","VEND EE CF TG","Energia venduta a clienti non domestici - MT Illuminazione pubblica","MWh"]
["102912.000000.010592","Grandezze tecnico fisiche per attività VEND EE CF TG",102912,10592,null,"Eliminata","VEND EE CF TG","Energia venduta a clienti non domestici - BT Illuminazione pubblica","MWh"]
["102912.000000.012120","Grandezze tecnico fisiche per attività VEND EE CF TG",102912,12120,null,"Eliminata","VEND EE CF TG","Clienti serviti nel cratere del sisma","Num."]
["102912.000000.012121","Grandezze tecnico fisiche per attività VEND EE CF TG",102912,12121,null,"Eliminata","VEND EE CF TG","Vendite nel cratere del sisma","MWh"]
["102970.000000.000964","Grandezze tecnico fisiche per attività VEND EE CF TG PI",102970,964,null,"Invariata","VEND EE CF TG PI","Forza lavoro a fine esercizio","Num. lavoratori","Forza lavoro a fine esercizio","Num. lavoratori","Forza lavoro a fine esercizio","Num. lavoratori"]
["102970.000000.000963","Grandezze tecnico fisiche per attività VEND EE CF TG PI",102970,963,null,"Invariata","VEND EE CF TG PI","Forza lavoro media annua","Num. lavoratori","Forza lavoro media annua","Num. lavoratori","Forza lavoro media annua","Num. lavoratori"]
["102970.000000.010620","Grandezze tecnico fisiche per attività VEND EE CF TG PI",102970,10620,null,"Invariata","VEND EE CF TG PI","Punti di prelievo medi annui relativi a clienti non domestici - Altissima tensione","Num.","Punti di prelievo medi annui relativi a clienti non domestici - Altissima tensione","Num.","Punti di prelievo medi annui relativi a clienti non domestici - Altissima tensione","Num."]
["102970.000000.001028","Grandezze tecnico fisiche per attività VEND EE CF TG PI",102970,1028,null,"Invariata","VEND EE CF TG PI","Punti di prelievo medi annui relativi a clienti domestici","Num.","Punti di prelievo medi annui relativi a clienti domestici","Num.","Punti di prelievo medi annui relativi a clienti domestici","Num."]
["102970.000000.001029","Grandezze tecnico fisiche per attività VEND EE CF TG PI",102970,1029,null,"Invariata","VEND EE CF TG PI","Punti di prelievo medi annui relativi a clienti non domestici - BT altri usi","Num.","Punti di prelievo medi annui relativi a clienti non domestici - BT altri usi","Num.","Punti di prelievo medi annui relativi a clienti non domestici - BT altri usi","Num."]
["102970.000000.001030","Grandezze tecnico fisiche per attività VEND EE CF TG PI",102970,1030,null,"Invariata","VEND EE CF TG PI","Punti di prelievo medi annui relativi a clienti non domestici - BT ILLUMINAZIONE PUBBLICA","Num.","Punti di prelievo medi annui relativi a clienti non domestici - BT ILLUMINAZIONE PUBBLICA","Num.","Punti di prelievo medi annui relativi a clienti non domestici - BT ILLUMINAZIONE PUBBLICA","Num."]
["102970.000000.001031","Grandezze tecnico fisiche per attività VEND EE CF TG PI",102970,1031,null,"Invariata","VEND EE CF TG PI","Punti di prelievo medi annui relativi a clienti non domestici - MT altri usi","Num.","Punti di prelievo medi annui relativi a clienti non domestici - MT altri usi","Num.","Punti di prelievo medi annui relativi a clienti non domestici - MT altri usi","Num."]
["102970.000000.001032","Grandezze tecnico fisiche per attività VEND EE CF TG PI",102970,1032,null,"Invariata","VEND EE CF TG PI","Punti di prelievo medi annui relativi a clienti non domestici - MT ILLUMINAZIONE PUBBLICA","Num.","Punti di prelievo medi annui relativi a clienti non domestici - MT ILLUMINAZIONE PUBBLICA","Num.","Punti di prelievo medi annui relativi a clienti non domestici - MT ILLUMINAZIONE PUBBLICA","Num."]
["102970.000000.001033","Grandezze tecnico fisiche per attività VEND EE CF TG PI",102970,1033,null,"Invariata","VEND EE CF TG PI","Punti di prelievo medi annui relativi a clienti non domestici - AT","Num.","Punti di prelievo medi annui relativi a clienti non domestici - AT","Num.","Punti di prelievo medi annui relativi a clienti non domestici - AT","Num."]
["102970.000000.010521","Grandezze tecnico fisiche per attività VEND EE CF TG PI",102970,10521,null,"Invariata","VEND EE CF TG PI","Energia venduta a clienti non domestici - MT altri usi","MWh","Energia venduta a clienti non domestici - MT altri usi","MWh","Energia venduta a clienti non domestici - MT altri usi","MWh"]
["102970.000000.010528","Grandezze tecnico fisiche per attività VEND EE CF TG PI",102970,10528,null,"Invariata","VEND EE CF TG PI","Energia venduta a clienti non domestici - AT","MWh","Energia venduta a clienti non domestici - AT","MWh","Energia venduta a clienti non domestici - AT","MWh"]
["102970.000000.010529","Grandezze tecnico fisiche per attività VEND EE CF TG PI",102970,10529,null,"Invariata","VEND EE CF TG PI","Energia venduta a clienti non domestici - Altissima tensione","MWh","Energia venduta a clienti non domestici - Altissima tensione","MWh","Energia venduta a clienti non domestici - Altissima tensione","MWh"]
["102970.000000.010547","Grandezze tecnico fisiche per attività VEND EE CF TG PI",102970,10547,null,"Invariata","VEND EE CF TG PI","Energia venduta a clienti non domestici - BT altri usi","MWh","Energia venduta a clienti non domestici - BT altri usi","MWh","Energia venduta a clienti non domestici - BT altri usi","MWh"]
["102970.000000.010579","Grandezze tecnico fisiche per attività VEND EE CF TG PI",102970,10579,null,"Invariata","VEND EE CF TG PI","Energia venduta a clienti domestici","MWh","Energia venduta a clienti domestici","MWh","Energia venduta a clienti domestici","MWh"]
["102970.000000.010584","Grandezze tecnico fisiche per attività VEND EE CF TG PI",102970,10584,null,"Invariata","VEND EE CF TG PI","Energia venduta a clienti non domestici - MT Illuminazione pubblica","MWh","Energia venduta a clienti non domestici - MT Illuminazione pubblica","MWh","Energia venduta a clienti non domestici - MT Illuminazione pubblica","MWh"]
["102970.000000.010592","Grandezze tecnico fisiche per attività VEND EE CF TG PI",102970,10592,null,"Invariata","VEND EE CF TG PI","Energia venduta a clienti non domestici - BT Illuminazione pubblica","MWh","Energia venduta a clienti non domestici - BT Illuminazione pubblica","MWh","Energia venduta a clienti non domestici - BT Illuminazione pubblica","MWh"]
["102970.000000.012120","Grandezze tecnico fisiche per attività VEND EE CF TG PI",102970,12120,null,"Invariata","VEND EE CF TG PI","Clienti serviti nel cratere del sisma","Num.","Clienti serviti nel cratere del sisma","Num.","Clienti serviti nel cratere del sisma","Num."]
["102970.000000.012121","Grandezze tecnico fisiche per attività VEND EE CF TG PI",102970,12121,null,"Invariata","VEND EE CF TG PI","Vendite nel cratere del sisma","MWh","Vendite nel cratere del sisma","MWh","Vendite nel cratere del sisma","MWh"]
["103014.000000.000964","Grandezze tecnico fisiche per attività VEND EE CF TG MI",103014,964,null,"Invariata","VEND EE CF TG MI","Forza lavoro a fine esercizio","Num. lavoratori","Forza lavoro a fine esercizio","Num. lavoratori","Forza lavoro a fine esercizio","Num. lavoratori"]
["103014.000000.000963","Grandezze tecnico fisiche per attività VEND EE CF TG MI",103014,963,null,"Invariata","VEND EE CF TG MI","Forza lavoro media annua","Num. lavoratori","Forza lavoro media annua","Num. lavoratori","Forza lavoro media annua","Num. lavoratori"]
["103014.000000.010620","Grandezze tecnico fisiche per attività VEND EE CF TG MI",103014,10620,null,"Invariata","VEND EE CF TG MI","Punti di prelievo medi annui relativi a clienti non domestici - Altissima tensione","Num.","Punti di prelievo medi annui relativi a clienti non domestici - Altissima tensione","Num.","Punti di prelievo medi annui relativi a clienti non domestici - Altissima tensione","Num."]
["103014.000000.001028","Grandezze tecnico fisiche per attività VEND EE CF TG MI",103014,1028,null,"Invariata","VEND EE CF TG MI","Punti di prelievo medi annui relativi a clienti domestici","Num.","Punti di prelievo medi annui relativi a clienti domestici","Num.","Punti di prelievo medi annui relativi a clienti domestici","Num."]
["103014.000000.001029","Grandezze tecnico fisiche per attività VEND EE CF TG MI",103014,1029,null,"Invariata","VEND EE CF TG MI","Punti di prelievo medi annui relativi a clienti non domestici - BT altri usi","Num.","Punti di prelievo medi annui relativi a clienti non domestici - BT altri usi","Num.","Punti di prelievo medi annui relativi a clienti non domestici - BT altri usi","Num."]
["103014.000000.001030","Grandezze tecnico fisiche per attività VEND EE CF TG MI",103014,1030,null,"Invariata","VEND EE CF TG MI","Punti di prelievo medi annui relativi a clienti non domestici - BT ILLUMINAZIONE PUBBLICA","Num.","Punti di prelievo medi annui relativi a clienti non domestici - BT ILLUMINAZIONE PUBBLICA","Num.","Punti di prelievo medi annui relativi a clienti non domestici - BT ILLUMINAZIONE PUBBLICA","Num."]
["103014.000000.001031","Grandezze tecnico fisiche per attività VEND EE CF TG MI",103014,1031,null,"Invariata","VEND EE CF TG MI","Punti di prelievo medi annui relativi a clienti non domestici - MT altri usi","Num.","Punti di prelievo medi annui relativi a clienti non domestici - MT altri usi","Num.","Punti di prelievo medi annui relativi a clienti non domestici - MT altri usi","Num."]
["103014.000000.001032","Grandezze tecnico fisiche per attività VEND EE CF TG MI",103014,1032,null,"Invariata","VEND EE CF TG MI","Punti di prelievo medi annui relativi a clienti non domestici - MT ILLUMINAZIONE PUBBLICA","Num.","Punti di prelievo medi annui relativi a clienti non domestici - MT ILLUMINAZIONE PUBBLICA","Num.","Punti di prelievo medi annui relativi a clienti non domestici - MT ILLUMINAZIONE PUBBLICA","Num."]
["103014.000000.001033","Grandezze tecnico fisiche per attività VEND EE CF TG MI",103014,1033,null,"Invariata","VEND EE CF TG MI","Punti di prelievo medi annui relativi a clienti non domestici - AT","Num.","Punti di prelievo medi annui relativi a clienti non domestici - AT","Num.","Punti di prelievo medi annui relativi a clienti non domestici - AT","Num."]
["103014.000000.010521","Grandezze tecnico fisiche per attività VEND EE CF TG MI",103014,10521,null,"Invariata","VEND EE CF TG MI","Energia venduta a clienti non domestici - MT altri usi","MWh","Energia venduta a clienti non domestici - MT altri usi","MWh","Energia venduta a clienti non domestici - MT altri usi","MWh"]
["103014.000000.010528","Grandezze tecnico fisiche per attività VEND EE CF TG MI",103014,10528,null,"Invariata","VEND EE CF TG MI","Energia venduta a clienti non domestici - AT","MWh","Energia venduta a clienti non domestici - AT","MWh","Energia venduta a clienti non domestici - AT","MWh"]
["103014.000000.010529","Grandezze tecnico fisiche per attività VEND EE CF TG MI",103014,10529,null,"Invariata","VEND EE CF TG MI","Energia venduta a clienti non domestici - Altissima tensione","MWh","Energia venduta a clienti non domestici - Altissima tensione","MWh","Energia venduta a clienti non domestici - Altissima tensione","MWh"]
["103014.000000.010547","Grandezze tecnico fisiche per attività VEND EE CF TG MI",103014,10547,null,"Invariata","VEND EE CF TG MI","Energia venduta a clienti non domestici - BT altri usi","MWh","Energia venduta a clienti non domestici - BT altri usi","MWh","Energia venduta a clienti non domestici - BT altri usi","MWh"]
["103014.000000.010579","Grandezze tecnico fisiche per attività VEND EE CF TG MI",103014,10579,null,"Invariata","VEND EE CF TG MI","Energia venduta a clienti domestici","MWh","Energia venduta a clienti domestici","MWh","Energia venduta a clienti domestici","MWh"]
["103014.000000.010584","Grandezze tecnico fisiche per attività VEND EE CF TG MI",103014,10584,null,"Invariata","VEND EE CF TG MI","Energia venduta a clienti non domestici - MT Illuminazione pubblica","MWh","Energia venduta a clienti non domestici - MT Illuminazione pubblica","MWh","Energia venduta a clienti non domestici - MT Illuminazione pubblica","MWh"]
["103014.000000.010592","Grandezze tecnico fisiche per attività VEND EE CF TG MI",103014,10592,null,"Invariata","VEND EE CF TG MI","Energia venduta a clienti non domestici - BT Illuminazione pubblica","MWh","Energia venduta a clienti non domestici - BT Illuminazione pubblica","MWh","Energia venduta a clienti non domestici - BT Illuminazione pubblica","MWh"]
["103014.000000.012120","Grandezze tecnico fisiche per attività VEND EE CF TG MI",103014,12120,null,"Invariata","VEND EE CF TG MI","Clienti serviti nel cratere del sisma","Num.","Clienti serviti nel cratere del sisma","Num.","Clienti serviti nel cratere del sisma","Num."]
["103014.000000.012121","Grandezze tecnico fisiche per attività VEND EE CF TG MI",103014,12121,null,"Invariata","VEND EE CF TG MI","Vendite nel cratere del sisma","MWh","Vendite nel cratere del sisma","MWh","Vendite nel cratere del sisma","MWh"]
["100840.000000.000964","Grandezze tecnico fisiche per attività EE ESTR",100840,964,null,"Invariata","EE ESTR","Forza lavoro a fine esercizio","Num. lavoratori","Forza lavoro a fine esercizio","Num. lavoratori","Forza lavoro a fine esercizio","Num. lavoratori"]
["100840.000000.000963","Grandezze tecnico fisiche per attività EE ESTR",100840,963,null,"Invariata","EE ESTR","Forza lavoro media annua","Num. lavoratori","Forza lavoro media annua","Num. lavoratori","Forza lavoro media annua","Num. lavoratori"]
["100835.000000.000964","Grandezze tecnico fisiche per attività COL GAS",100835,964,null,"Invariata","COL GAS","Forza lavoro a fine esercizio","Num. lavoratori","Forza lavoro a fine esercizio","Num. lavoratori","Forza lavoro a fine esercizio","Num. lavoratori"]
["100835.000000.000963","Grandezze tecnico fisiche per attività COL GAS",100835,963,null,"Invariata","COL GAS","Forza lavoro media annua","Num. lavoratori","Forza lavoro media annua","Num. lavoratori","Forza lavoro media annua","Num. lavoratori"]
["100835.000000.010522","Grandezze tecnico fisiche per attività COL GAS",100835,10522,null,"Invariata","COL GAS","Volume di gas per autoconsumo","Msm3/anno","Volume di gas per autoconsumo","Msm3/anno","Volume di gas per autoconsumo","Msm3/anno"]
["100835.000000.010549","Grandezze tecnico fisiche per attività COL GAS",100835,10549,null,"Invariata","COL GAS","Volume di gas immesso su reti di trasporto terzi","Msm3/anno","Volume di gas immesso su reti di trasporto terzi","Msm3/anno","Volume di gas immesso su reti di trasporto terzi","Msm3/anno"]
["100835.000000.010573","Grandezze tecnico fisiche per attività COL GAS",100835,10573,null,"Invariata","COL GAS","Volume di gas prodotto","Msm3/anno","Volume di gas prodotto","Msm3/anno","Volume di gas prodotto","Msm3/anno"]
["100835.000000.010581","Grandezze tecnico fisiche per attività COL GAS",100835,10581,null,"Invariata","COL GAS","Volume di gas venduto a terzi","Msm3/anno","Volume di gas venduto a terzi","Msm3/anno","Volume di gas venduto a terzi","Msm3/anno"]
["000333.000000.000964","Grandezze tecnico fisiche per attività DIST GAS",333,964,null,"Invariata","DIST GAS","Forza lavoro a fine esercizio","Num. lavoratori","Forza lavoro a fine esercizio","Num. lavoratori","Forza lavoro a fine esercizio","Num. lavoratori"]
["000333.000000.000963","Grandezze tecnico fisiche per attività DIST GAS",333,963,null,"Invariata","DIST GAS","Forza lavoro media annua","Num. lavoratori","Forza lavoro media annua","Num. lavoratori","Forza lavoro media annua","Num. lavoratori"]
[{"$f":"CONCATENATE(TEXT(C195,\"000000\"),\".\",TEXT(E195,\"000000\"),\".\",TEXT(D195,\"000000\"))","v":"000333.000000.011077"},"Grandezze tecnico fisiche per attività DIST GAS",333,11077,null,{"$f":"IF(AND(H195=J195,I195=K195),\"Invariata\",IF(H195=\"\",\"Aggiunta\",IF(J195=\"\",\"Eliminata\",\"Modificata\")))","v":"Invariata"},"DIST GAS","Punti di riconsegna a fine esercizio","Num.","Punti di riconsegna a fine esercizio","Num.","Punti di riconsegna a fine esercizio","Num."]
["000333.000000.011078","Grandezze tecnico fisiche per attività DIST GAS",333,11078,null,"Invariata","DIST GAS","Punti di riconsegna medi annui","Num.","Punti di riconsegna medi annui","Num.","Punti di riconsegna medi annui","Num."]
["000333.000000.001085","Grandezze tecnico fisiche per attività DIST GAS",333,1085,null,"Invariata","DIST GAS","Volumi gas: immesso","Msm3/anno","Volumi gas: immesso","Msm3/anno","Volumi gas: immesso","Msm3/anno"]
["000333.000000.001086","Grandezze tecnico fisiche per attività DIST GAS",333,1086,null,"Invariata","DIST GAS","Volumi gas: riconsegnato","Msm3/anno","Volumi gas: riconsegnato","Msm3/anno","Volumi gas: riconsegnato","Msm3/anno"]
["000333.000000.001099","Grandezze tecnico fisiche per attività DIST GAS",333,1099,null,"Invariata","DIST GAS","Rete in esercizio a fine esercizio","km","Rete in esercizio a fine esercizio","km","Rete in esercizio a fine esercizio","km"]
["000334.000000.000964","Grandezze tecnico fisiche per attività MIS GAS",334,964,null,"Invariata","MIS GAS","Forza lavoro a fine esercizio","Num. lavoratori","Forza lavoro a fine esercizio","Num. lavoratori","Forza lavoro a fine esercizio","Num. lavoratori"]
["000334.000000.000963","Grandezze tecnico fisiche per attività MIS GAS",334,963,null,"Invariata","MIS GAS","Forza lavoro media annua","Num. lavoratori","Forza lavoro media annua","Num. lavoratori","Forza lavoro media annua","Num. lavoratori"]
["100842.000000.000964","Grandezze tecnico fisiche per attività VEN I GAS",100842,964,null,"Invariata","VEN I GAS","Forza lavoro a fine esercizio","Num. lavoratori","Forza lavoro a fine esercizio","Num. lavoratori","Forza lavoro a fine esercizio","Num. lavoratori"]
["100842.000000.000963","Grandezze tecnico fisiche per attività VEN I GAS",100842,963,null,"Invariata","VEN I GAS","Forza lavoro media annua","Num. lavoratori","Forza lavoro media annua","Num. lavoratori","Forza lavoro media annua","Num. lavoratori"]
["100842.000000.001107","Grandezze tecnico fisiche per attività VEN I GAS",100842,1107,null,"Invariata","VEN I GAS","Clienti attivi a fine esercizio","Num. clienti","Clienti attivi a fine esercizio","Num. clienti","Clienti attivi a fine esercizio","Num. clienti"]
["100842.000000.001108","Grandezze tecnico fisiche per attività VEN I GAS",100842,1108,null,"Invariata","VEN I GAS","Punti di riconsegna serviti","Num. punti","Punti di riconsegna serviti","Num. punti","Punti di riconsegna serviti","Num. punti"]
["100842.000000.010523","Grandezze tecnico fisiche per attività VEN I GAS",100842,10523,null,"Invariata","VEN I GAS","Volume di gas venduto all'estero destinato a paesi terzi","Msm3/anno","Volume di gas venduto all'estero destinato a paesi terzi","Msm3/anno","Volume di gas venduto all'estero destinato a paesi terzi","Msm3/anno"]
["100842.000000.010530","Grandezze tecnico fisiche per attività VEN I GAS",100842,10530,null,"Invariata","VEN I GAS","Volume di gas acquistato Italia su Italia per coltivazione","Msm3/anno","Volume di gas acquistato Italia su Italia per coltivazione","Msm3/anno","Volume di gas acquistato Italia su Italia per coltivazione","Msm3/anno"]
["100842.000000.010537","Grandezze tecnico fisiche per attività VEN I GAS",100842,10537,null,"Invariata","VEN I GAS","Volume di gas venduto Italia su Italia per stoccaggio","Msm3/anno","Volume di gas venduto Italia su Italia per stoccaggio","Msm3/anno","Volume di gas venduto Italia su Italia per stoccaggio","Msm3/anno"]
["100842.000000.010540","Grandezze tecnico fisiche per attività VEN I GAS",100842,10540,null,"Invariata","VEN I GAS","Volume di gas venduto all'estero a imprese terze destinato all'Italia","Msm3/anno","Volume di gas venduto all'estero a imprese terze destinato all'Italia","Msm3/anno","Volume di gas venduto all'estero a imprese terze destinato all'Italia","Msm3/anno"]
["100842.000000.010542","Grandezze tecnico fisiche per attività VEN I GAS",100842,10542,null,"Invariata","VEN I GAS","Volume di gas venduto Italia su Italia ad altre imprese del gruppo","Msm3/anno","Volume di gas venduto Italia su Italia ad altre imprese del gruppo","Msm3/anno","Volume di gas venduto Italia su Italia ad altre imprese del gruppo","Msm3/anno"]
["100842.000000.010544","Grandezze tecnico fisiche per attività VEN I GAS",100842,10544,null,"Invariata","VEN I GAS","Volume di gas acquistato Italia su Italia da altre imprese del gruppo","Msm3/anno","Volume di gas acquistato Italia su Italia da altre imprese del gruppo","Msm3/anno","Volume di gas acquistato Italia su Italia da altre imprese del gruppo","Msm3/anno"]
["100842.000000.010546","Grandezze tecnico fisiche per attività VEN I GAS",100842,10546,null,"Invariata","VEN I GAS","Volume di gas venduto all'estero a imprese del gruppo destinato all'Italia","Msm3/anno","Volume di gas venduto all'estero a imprese del gruppo destinato all'Italia","Msm3/anno","Volume di gas venduto all'estero a imprese del gruppo destinato all'Italia","Msm3/anno"]
["100842.000000.010548","Grandezze tecnico fisiche per attività VEN I GAS",100842,10548,null,"Invariata","VEN I GAS","Volume di gas venduto Italia su Italia per coltivazione","Msm3/anno","Volume di gas venduto Italia su Italia per coltivazione","Msm3/anno","Volume di gas venduto Italia su Italia per coltivazione","Msm3/anno"]
["100842.000000.010552","Grandezze tecnico fisiche per attività VEN I GAS",100842,10552,null,"Invariata","VEN I GAS","Volume di gas venduto estero su estero ad altre imprese del gruppo","Msm3/anno","Volume di gas venduto estero su estero ad altre imprese del gruppo","Msm3/anno","Volume di gas venduto estero su estero ad altre imprese del gruppo","Msm3/anno"]
["100842.000000.010553","Grandezze tecnico fisiche per attività VEN I GAS",100842,10553,null,"Invariata","VEN I GAS","Volume di gas venduto alla frontiera a imprese terze destinato all'Italia","Msm3/anno","Volume di gas venduto alla frontiera a imprese terze destinato all'Italia","Msm3/anno","Volume di gas venduto alla frontiera a imprese terze destinato all'Italia","Msm3/anno"]
["100842.000000.010556","Grandezze tecnico fisiche per attività VEN I GAS",100842,10556,null,"Invariata","VEN I GAS","Volume di gas acquistato all'estero destinato a paesi terzi","Msm3/anno","Volume di gas acquistato all'estero destinato a paesi terzi","Msm3/anno","Volume di gas acquistato all'estero destinato a paesi terzi","Msm3/anno"]
["100842.000000.010559","Grandezze tecnico fisiche per attività VEN I GAS",100842,10559,null,"Invariata","VEN I GAS","Volume di gas venduto estero su estero a terzi","Msm3/anno","Volume di gas venduto estero su estero a terzi","Msm3/anno","Volume di gas venduto estero su estero a terzi","Msm3/anno"]
["100842.000000.010561","Grandezze tecnico fisiche per attività VEN I GAS",100842,10561,null,"Invariata","VEN I GAS","Volume di gas acquistato all'estero da imprese terze destinato all'Italia","Msm3/anno","Volume di gas acquistato all'estero da imprese terze destinato all'Italia","Msm3/anno","Volume di gas acquistato all'estero da imprese terze destinato all'Italia","Msm3/anno"]
["100842.000000.010564","Grandezze tecnico fisiche per attività VEN I GAS",100842,10564,null,"Invariata","VEN I GAS","Volume di gas acquistato alla frontiera da imprese terze destinato all'Italia","Msm3/anno","Volume di gas acquistato alla frontiera da imprese terze destinato all'Italia","Msm3/anno","Volume di gas acquistato alla frontiera da imprese terze destinato all'Italia","Msm3/anno"]
["100842.000000.010571","Grandezze tecnico fisiche per attività VEN I GAS",100842,10571,null,"Invariata","VEN I GAS","Volume di gas acquistato estero su estero da altre imprese del gruppo","Msm3/anno","Volume di gas acquistato estero su estero da altre imprese del gruppo","Msm3/anno","Volume di gas acquistato estero su estero da altre imprese del gruppo","Msm3/anno"]
["100842.000000.010572","Grandezze tecnico fisiche per attività VEN I GAS",100842,10572,null,"Invariata","VEN I GAS","Volume di gas venduto sul psv","Msm3/anno","Volume di gas venduto sul psv","Msm3/anno","Volume di gas venduto sul psv","Msm3/anno"]
["100842.000000.010576","Grandezze tecnico fisiche per attività VEN I GAS",100842,10576,null,"Invariata","VEN I GAS","Volume di gas acquistato all'estero da imprese del gruppo destinato all'Italia","Msm3/anno","Volume di gas acquistato all'estero da imprese del gruppo destinato all'Italia","Msm3/anno","Volume di gas acquistato all'estero da imprese del gruppo destinato all'Italia","Msm3/anno"]
["100842.000000.010587","Grandezze tecnico fisiche per attività VEN I GAS",100842,10587,null,"Invariata","VEN I GAS","Volume di gas acquistato sul psv","Msm3/anno","Volume di gas acquistato sul psv","Msm3/anno","Volume di gas acquistato sul psv","Msm3/anno"]
["100842.000000.010588","Grandezze tecnico fisiche per attività VEN I GAS",100842,10588,null,"Invariata","VEN I GAS","Volume di gas acquistato estero su estero","Msm3/anno","Volume di gas acquistato estero su estero","Msm3/anno","Volume di gas acquistato estero su estero","Msm3/anno"]
["100842.000000.010593","Grandezze tecnico fisiche per attività VEN I GAS",100842,10593,null,"Invariata","VEN I GAS","Volume di gas acquistato Italia su Italia per stoccaggio","Msm3/anno","Volume di gas acquistato Italia su Italia per stoccaggio","Msm3/anno","Volume di gas acquistato Italia su Italia per stoccaggio","Msm3/anno"]
["100842.000000.010660","Grandezze tecnico fisiche per attività VEN I GAS",100842,10660,null,"Invariata","VEN I GAS","Volume di gas acquistato Italia su Italia da imprese terze","Msm3/anno","Volume di gas acquistato Italia su Italia da imprese terze","Msm3/anno","Volume di gas acquistato Italia su Italia da imprese terze","Msm3/anno"]
["100832.000000.000964","Grandezze tecnico fisiche per attività VEN F GAS ST",100832,964,null,"Eliminata","VEN F GAS ST","Forza lavoro a fine esercizio","Num. lavoratori"]
["100832.000000.000963","Grandezze tecnico fisiche per attività VEN F GAS ST",100832,963,null,"Eliminata","VEN F GAS ST","Forza lavoro media annua","Num. lavoratori"]
["100832.000000.011079","Grandezze tecnico fisiche per attività VEN F GAS ST",100832,11079,null,"Eliminata","VEN F GAS ST","Clienti tutelati (Numero a fine esercizio)","Num."]
["100832.000000.011080","Grandezze tecnico fisiche per attività VEN F GAS ST",100832,11080,null,"Eliminata","VEN F GAS ST","Clienti tutelati (Numero medio nell'esercizio)","Num."]
["100832.000000.010516","Grandezze tecnico fisiche per attività VEN F GAS ST",100832,10516,null,"Eliminata","VEN F GAS ST","Volume di gas acquistato","Msm3/anno"]
["100832.000000.001110","Grandezze tecnico fisiche per attività VEN F GAS ST",100832,1110,null,"Eliminata","VEN F GAS ST","Clienti tutelati aventi prezzi regolati","Num. medio annuo"]
["100832.000000.001112","Grandezze tecnico fisiche per attività VEN F GAS ST",100832,1112,null,"Eliminata","VEN F GAS ST","Vendite a clienti tutelati aventi prezzi regolati","Sm3/anno"]
["100832.000000.012122","Grandezze tecnico fisiche per attività VEN F GAS ST",100832,12122,null,"Eliminata","VEN F GAS ST","Clienti serviti nell'ambito del FUI","Num."]
["100832.000000.012123","Grandezze tecnico fisiche per attività VEN F GAS ST",100832,12123,null,"Eliminata","VEN F GAS ST","Clienti serviti nell'ambito del FT traporto","Num."]
["100832.000000.012124","Grandezze tecnico fisiche per attività VEN F GAS ST",100832,12124,null,"Eliminata","VEN F GAS ST","Clienti serviti nell'ambito del FDD","Num."]
["100832.000000.012126","Grandezze tecnico fisiche per attività VEN F GAS ST",100832,12126,null,"Eliminata","VEN F GAS ST","Vendite nell'ambito del FUI","Sm3/anno"]
["100832.000000.012127","Grandezze tecnico fisiche per attività VEN F GAS ST",100832,12127,null,"Eliminata","VEN F GAS ST","Vendite nell'ambito del FT traporto","Sm3/anno"]
["100832.000000.012128","Grandezze tecnico fisiche per attività VEN F GAS ST",100832,12128,null,"Eliminata","VEN F GAS ST","Vendite nell'ambito del FDD","Sm3/anno"]
["100838.000000.000964","Grandezze tecnico fisiche per attività VEN F GAS ML",100838,964,null,"Invariata","VEN F GAS ML","Forza lavoro a fine esercizio","Num. lavoratori","Forza lavoro a fine esercizio","Num. lavoratori","Forza lavoro a fine esercizio","Num. lavoratori"]
["100838.000000.000963","Grandezze tecnico fisiche per attività VEN F GAS ML",100838,963,null,"Invariata","VEN F GAS ML","Forza lavoro media annua","Num. lavoratori","Forza lavoro media annua","Num. lavoratori","Forza lavoro media annua","Num. lavoratori"]
["100838.000000.011083","Grandezze tecnico fisiche per attività VEN F GAS ML",100838,11083,null,"Invariata","VEN F GAS ML","Clienti nel libero mercato (Numero medio nell'esercizio)","Num.","Clienti nel libero mercato (Numero medio nell'esercizio)","Num.","Clienti nel libero mercato (Numero medio nell'esercizio)","Num."]
["100838.000000.011081","Grandezze tecnico fisiche per attività VEN F GAS ML",100838,11081,null,"Invariata","VEN F GAS ML","Volume di gas venduto","Num.","Volume di gas venduto","Num.","Volume di gas venduto","Num."]
["100838.000000.011082","Grandezze tecnico fisiche per attività VEN F GAS ML",100838,11082,null,"Invariata","VEN F GAS ML","Clienti nel libero mercato (Numero a fine esercizio)","Num.","Clienti nel libero mercato (Numero a fine esercizio)","Num.","Clienti nel libero mercato (Numero a fine esercizio)","Num."]
["100838.000000.010516","Grandezze tecnico fisiche per attività VEN F GAS ML",100838,10516,null,"Invariata","VEN F GAS ML","Volume di gas acquistato","Msm3/anno","Volume di gas acquistato","Msm3/anno","Volume di gas acquistato","Msm3/anno"]
["100838.000000.001109","Grandezze tecnico fisiche per attività VEN F GAS ML",100838,1109,null,"Invariata","VEN F GAS ML","Clienti a condizioni di mercato libero","Num. medio annuo","Clienti a condizioni di mercato libero","Num. medio annuo","Clienti a condizioni di mercato libero","Num. medio annuo"]
["100838.000000.001111","Grandezze tecnico fisiche per attività VEN F GAS ML",100838,1111,null,"Invariata","VEN F GAS ML","Vendite a condizioni di mercato libero","Sm3/anno","Vendite a condizioni di mercato libero","Sm3/anno","Vendite a condizioni di mercato libero","Sm3/anno"]
["100715.000000.000964","Grandezze tecnico fisiche per attività DIST GAS DIV",100715,964,null,"Invariata","DIST GAS DIV","Forza lavoro a fine esercizio","Num. lavoratori","Forza lavoro a fine esercizio","Num. lavoratori","Forza lavoro a fine esercizio","Num. lavoratori"]
["100715.000000.000963","Grandezze tecnico fisiche per attività DIST GAS DIV",100715,963,null,"Invariata","DIST GAS DIV","Forza lavoro media annua","Num. lavoratori","Forza lavoro media annua","Num. lavoratori","Forza lavoro media annua","Num. lavoratori"]
["100715.000000.010516","Grandezze tecnico fisiche per attività DIST GAS DIV",100715,10516,null,"Invariata","DIST GAS DIV","Volume di gas acquistato","Msm3/anno","Volume di gas acquistato","Msm3/anno","Volume di gas acquistato","Msm3/anno"]
["100715.000000.001085","Grandezze tecnico fisiche per attività DIST GAS DIV",100715,1085,null,"Invariata","DIST GAS DIV","Volumi gas: immesso","Msm3/anno","Volumi gas: immesso","Msm3/anno","Volumi gas: immesso","Msm3/anno"]
["100715.000000.001095","Grandezze tecnico fisiche per attività DIST GAS DIV",100715,1095,null,"Invariata","DIST GAS DIV","Allacciamenti in esercizio a fine esercizio","Num. allacciamenti","Allacciamenti in esercizio a fine esercizio","Num. allacciamenti","Allacciamenti in esercizio a fine esercizio","Num. allacciamenti"]
["100715.000000.001099","Grandezze tecnico fisiche per attività DIST GAS DIV",100715,1099,null,"Invariata","DIST GAS DIV","Rete in esercizio a fine esercizio","km","Rete in esercizio a fine esercizio","km","Rete in esercizio a fine esercizio","km"]
["100715.000000.001100","Grandezze tecnico fisiche per attività DIST GAS DIV",100715,1100,null,"Invariata","DIST GAS DIV","Rete in esercizio a fine esercizio posata nell'anno","km","Rete in esercizio a fine esercizio posata nell'anno","km","Rete in esercizio a fine esercizio posata nell'anno","km"]
["100715.000000.001106","Grandezze tecnico fisiche per attività DIST GAS DIV",100715,1106,null,"Invariata","DIST GAS DIV","Volumi gas venduto","Msm3/anno","Volumi gas venduto","Msm3/anno","Volumi gas venduto","Msm3/anno"]
["100715.000000.001107","Grandezze tecnico fisiche per attività DIST GAS DIV",100715,1107,null,"Invariata","DIST GAS DIV","Clienti attivi a fine esercizio","Num. clienti","Clienti attivi a fine esercizio","Num. clienti","Clienti attivi a fine esercizio","Num. clienti"]
["100844.000000.000964","Grandezze tecnico fisiche per attività GAS ESTR",100844,964,null,"Invariata","GAS ESTR","Forza lavoro a fine esercizio","Num. lavoratori","Forza lavoro a fine esercizio","Num. lavoratori","Forza lavoro a fine esercizio","Num. lavoratori"]
["100844.000000.000963","Grandezze tecnico fisiche per attività GAS ESTR",100844,963,null,"Invariata","GAS ESTR","Forza lavoro media annua","Num. lavoratori","Forza lavoro media annua","Num. lavoratori","Forza lavoro media annua","Num. lavoratori"]
[{"$f":"CONCATENATE(TEXT(C259,\"000000\"),\".\",TEXT(E259,\"000000\"),\".\",TEXT(D259,\"000000\"))","v":"100792.000000.000964"},"Grandezze tecnico fisiche per attività ATT DIVT",100792,964,null,{"$f":"IF(AND(H259=J259,I259=K259),\"Invariata\",IF(H259=\"\",\"Aggiunta\",IF(J259=\"\",\"Eliminata\",\"Modificata\")))","v":"Invariata"},"ATT DIVT","Forza lavoro a fine esercizio","Num. lavoratori","Forza lavoro a fine esercizio","Num. lavoratori","Forza lavoro a fine esercizio","Num. lavoratori"]
["100792.000000.000963","Grandezze tecnico fisiche per attività ATT DIVT",100792,963,null,"Invariata","ATT DIVT","Forza lavoro media annua","Num. lavoratori","Forza lavoro media annua","Num. lavoratori","Forza lavoro media annua","Num. lavoratori"]
["000000.000000.000964","Grandezze tecnico fisiche per attività VEND EE CF CDNV",null,964,null,"Aggiunta","VEND EE CF CDNV",{"$nulls":3},"Forza lavoro a fine esercizio","Forza lavoro a fine esercizio"]
["000000.000000.000963","Grandezze tecnico fisiche per attività VEND EE CF CDNV",null,963,null,"Aggiunta","VEND EE CF CDNV",{"$nulls":3},"Forza lavoro media annua","Forza lavoro media annua"]
["000000.000000.001028","Grandezze tecnico fisiche per attività VEND EE CF CDNV",null,1028,null,"Aggiunta","VEND EE CF CDNV",{"$nulls":3},"Punti di prelievo medi annui relativi a clienti domestici","Punti di prelievo medi annui relativi a clienti domestici"]
["000000.000000.010579","Grandezze tecnico fisiche per attività VEND EE CF CDNV",null,10579,null,"Aggiunta","VEND EE CF CDNV",{"$nulls":3},"Energia venduta a clienti domestici","Energia venduta a clienti domestici"]
["000000.000000.012120","Grandezze tecnico fisiche per attività VEND EE CF CDNV",null,12120,null,"Aggiunta","VEND EE CF CDNV",{"$nulls":3},"Clienti serviti nel cratere del sisma","Clienti serviti nel cratere del sisma"]
["000000.000000.012121","Grandezze tecnico fisiche per attività VEND EE CF CDNV",null,12121,null,"Aggiunta","VEND EE CF CDNV",{"$nulls":3},"Vendite nel cratere del sisma","Vendite nel cratere del sisma"]
["000000.000000.000964","Grandezze tecnico fisiche per attività VEN F GAS STV",null,964,null,"Aggiunta","VEN F GAS STV",{"$nulls":3},"Forza lavoro a fine esercizio","Forza lavoro a fine esercizio"]
["000000.000000.000963","Grandezze tecnico fisiche per attività VEN F GAS STV",null,963,null,"Aggiunta","VEN F GAS STV",{"$nulls":3},"Forza lavoro media annua","Forza lavoro media annua"]
["000000.000000.011079","Grandezze tecnico fisiche per attività VEN F GAS STV",null,11079,null,"Aggiunta","VEN F GAS STV",{"$nulls":3},"Clienti tutelati (Numero a fine esercizio)","Clienti tutelati (Numero a fine esercizio)"]
["000000.000000.011080","Grandezze tecnico fisiche per attività VEN F GAS STV",null,11080,null,"Aggiunta","VEN F GAS STV",{"$nulls":3},"Clienti tutelati (Numero medio nell'esercizio)","Clienti tutelati (Numero medio nell'esercizio)"]
["000000.000000.010516","Grandezze tecnico fisiche per attività VEN F GAS STV",null,10516,null,"Aggiunta","VEN F GAS STV",{"$nulls":3},"Volume di gas acquistato","Volume di gas acquistato"]
["000000.000000.001110","Grandezze tecnico fisiche per attività VEN F GAS STV",null,1110,null,"Aggiunta","VEN F GAS STV",{"$nulls":3},"Clienti tutelati aventi prezzi regolati","Clienti tutelati aventi prezzi regolati"]
["000000.000000.001112","Grandezze tecnico fisiche per attività VEN F GAS STV",null,1112,null,"Aggiunta","VEN F GAS STV",{"$nulls":3},"Vendite a clienti tutelati aventi prezzi regolati","Vendite a clienti tutelati aventi prezzi regolati"]
["000000.000000.012122","Grandezze tecnico fisiche per attività VEN F GAS STV",null,12122,null,"Aggiunta","VEN F GAS STV",{"$nulls":3},"Clienti serviti nell'ambito del FUI","Clienti serviti nell'ambito del FUI"]
["000000.000000.012123","Grandezze tecnico fisiche per attività VEN F GAS STV",null,12123,null,"Aggiunta","VEN F GAS STV",{"$nulls":3},"Clienti serviti nell'ambito del FT traporto","Clienti serviti nell'ambito del FT traporto"]
["000000.000000.012124","Grandezze tecnico fisiche per attività VEN F GAS STV",null,12124,null,"Aggiunta","VEN F GAS STV",{"$nulls":3},"Clienti serviti nell'ambito del FDD","Clienti serviti nell'ambito del FDD"]
["000000.000000.012126","Grandezze tecnico fisiche per attività VEN F GAS STV",null,12126,null,"Aggiunta","VEN F GAS STV",{"$nulls":3},"Vendite nell'ambito del FUI","Vendite nell'ambito del FUI"]
["000000.000000.012127","Grandezze tecnico fisiche per attività VEN F GAS STV",null,12127,null,"Aggiunta","VEN F GAS STV",{"$nulls":3},"Vendite nell'ambito del FT traporto","Vendite nell'ambito del FT traporto"]
["000000.000000.012128","Grandezze tecnico fisiche per attività VEN F GAS STV",null,12128,null,"Aggiunta","VEN F GAS STV",{"$nulls":3},"Vendite nell'ambito del FDD","Vendite nell'ambito del FDD"]
["***.000000.000964","Grandezze tecnico fisiche per attività VEND EE CF TG CDNV","***",964,null,"Aggiunta","VEND EE CF TG CDNV",null,null,"Forza lavoro a fine esercizio","Num. lavoratori","Forza lavoro a fine esercizio","Num. lavoratori"]
["***.000000.000963","Grandezze tecnico fisiche per attività VEND EE CF TG CDNV","***",963,null,"Aggiunta","VEND EE CF TG CDNV",null,null,"Forza lavoro media annua","Num. lavoratori","Forza lavoro media annua","Num. lavoratori"]
["***.000000.010620","Grandezze tecnico fisiche per attività VEND EE CF TG CDNV","***",10620,null,"Aggiunta","VEND EE CF TG CDNV",null,null,"Punti di prelievo medi annui relativi a clienti non domestici - Altissima tensione","Num.","Punti di prelievo medi annui relativi a clienti non domestici - Altissima tensione","Num."]
["***.000000.001028","Grandezze tecnico fisiche per attività VEND EE CF TG CDNV","***",1028,null,"Aggiunta","VEND EE CF TG CDNV",null,null,"Punti di prelievo medi annui relativi a clienti domestici","Num.","Punti di prelievo medi annui relativi a clienti domestici","Num."]
["***.000000.001029","Grandezze tecnico fisiche per attività VEND EE CF TG CDNV","***",1029,null,"Aggiunta","VEND EE CF TG CDNV",null,null,"Punti di prelievo medi annui relativi a clienti non domestici - BT altri usi","Num.","Punti di prelievo medi annui relativi a clienti non domestici - BT altri usi","Num."]
["***.000000.001030","Grandezze tecnico fisiche per attività VEND EE CF TG CDNV","***",1030,null,"Aggiunta","VEND EE CF TG CDNV",null,null,"Punti di prelievo medi annui relativi a clienti non domestici - BT ILLUMINAZIONE PUBBLICA","Num.","Punti di prelievo medi annui relativi a clienti non domestici - BT ILLUMINAZIONE PUBBLICA","Num."]
["***.000000.001031","Grandezze tecnico fisiche per attività VEND EE CF TG CDNV","***",1031,null,"Aggiunta","VEND EE CF TG CDNV",null,null,"Punti di prelievo medi annui relativi a clienti non domestici - MT altri usi","Num.","Punti di prelievo medi annui relativi a clienti non domestici - MT altri usi","Num."]
["***.000000.001032","Grandezze tecnico fisiche per attività VEND EE CF TG CDNV","***",1032,null,"Aggiunta","VEND EE CF TG CDNV",null,null,"Punti di prelievo medi annui relativi a clienti non domestici - MT ILLUMINAZIONE PUBBLICA","Num.","Punti di prelievo medi annui relativi a clienti non domestici - MT ILLUMINAZIONE PUBBLICA","Num."]
["***.000000.001033","Grandezze tecnico fisiche per attività VEND EE CF TG CDNV","***",1033,null,"Aggiunta","VEND EE CF TG CDNV",null,null,"Punti di prelievo medi annui relativi a clienti non domestici - AT","Num.","Punti di prelievo medi annui relativi a clienti non domestici - AT","Num."]
["***.000000.010521","Grandezze tecnico fisiche per attività VEND EE CF TG CDNV","***",10521,null,"Aggiunta","VEND EE CF TG CDNV",null,null,"Energia venduta a clienti non domestici - MT altri usi","MWh","Energia venduta a clienti non domestici - MT altri usi","MWh"]
["***.000000.010528","Grandezze tecnico fisiche per attività VEND EE CF TG CDNV","***",10528,null,"Aggiunta","VEND EE CF TG CDNV",null,null,"Energia venduta a clienti non domestici - AT","MWh","Energia venduta a clienti non domestici - AT","MWh"]
["***.000000.010529","Grandezze tecnico fisiche per attività VEND EE CF TG CDNV","***",10529,null,"Aggiunta","VEND EE CF TG CDNV",null,null,"Energia venduta a clienti non domestici - Altissima tensione","MWh","Energia venduta a clienti non domestici - Altissima tensione","MWh"]
["***.000000.010547","Grandezze tecnico fisiche per attività VEND EE CF TG CDNV","***",10547,null,"Aggiunta","VEND EE CF TG CDNV",null,null,"Energia venduta a clienti non domestici - BT altri usi","MWh","Energia venduta a clienti non domestici - BT altri usi","MWh"]
["***.000000.010579","Grandezze tecnico fisiche per attività VEND EE CF TG CDNV","***",10579,null,"Aggiunta","VEND EE CF TG CDNV",null,null,"Energia venduta a clienti domestici","MWh","Energia venduta a clienti domestici","MWh"]
["***.000000.010584","Grandezze tecnico fisiche per attività VEND EE CF TG CDNV","***",10584,null,"Aggiunta","VEND EE CF TG CDNV",null,null,"Energia venduta a clienti non domestici - MT Illuminazione pubblica","MWh","Energia venduta a clienti non domestici - MT Illuminazione pubblica","MWh"]
["***.000000.010592","Grandezze tecnico fisiche per attività VEND EE CF TG CDNV","***",10592,null,"Aggiunta","VEND EE CF TG CDNV",null,null,"Energia venduta a clienti non domestici - BT Illuminazione pubblica","MWh","Energia venduta a clienti non domestici - BT Illuminazione pubblica","MWh"]
["***.000000.012120","Grandezze tecnico fisiche per attività VEND EE CF TG CDNV","***",12120,null,"Aggiunta","VEND EE CF TG CDNV",null,null,"Clienti serviti nel cratere del sisma","Num.","Clienti serviti nel cratere del sisma","Num."]
["***.000000.012121","Grandezze tecnico fisiche per attività VEND EE CF TG CDNV","***",12121,null,"Aggiunta","VEND EE CF TG CDNV",null,null,"Vendite nel cratere del sisma","MWh","Vendite nel cratere del sisma","MWh"]

{"sheet":"Grandezze Monetarie","index":3,"n_rows":281,"n_cols":13,"rows_kept":281}
["Indice","Prospetto old","ID prospetto","ID voce","ID voce padre","Modifica","Prospetto","Voce 2024","Unità di misura 2024","Voce 2025","Unità di misura 2025","Voce 2026","Unità di misura 2026"]
[{"$f":"CONCATENATE(TEXT(C2,\"000000\"),\".\",TEXT(E2,\"000000\"),\".\",TEXT(D2,\"000000\"))","v":"100678.000000.002030"},"Grandezze monetarie per attività VEND CL LIB EE",100678,2030,null,{"$f":"IF(AND(H2=J2,I2=K2),\"Invariata\",IF(H2=\"\",\"Aggiunta\",IF(J2=\"\",\"Eliminata\",\"Modificata\")))","v":"Invariata"},"VEND CL LIB EE","Fatturato","euro","Fatturato","euro","Fatturato","euro"]
[{"$f":"CONCATENATE(TEXT(C3,\"000000\"),\".\",TEXT(E3,\"000000\"),\".\",TEXT(D3,\"000000\"))","v":"100678.002030.002031"},"Grandezze monetarie per attività VEND CL LIB EE",100678,2031,2030,{"$f":"IF(AND(H3=J3,I3=K3),\"Invariata\",IF(H3=\"\",\"Aggiunta\",IF(J3=\"\",\"Eliminata\",\"Modificata\")))","v":"Invariata"},"VEND CL LIB EE","Ricavi da vendita ","euro","Ricavi da vendita ","euro","Ricavi da vendita ","euro"]
["100678.002030.002032","Grandezze monetarie per attività VEND CL LIB EE",100678,2032,2030,"Invariata","VEND CL LIB EE","Altre prestanzioni","euro","Altre prestanzioni","euro","Altre prestanzioni","euro"]
["100678.002030.002033","Grandezze monetarie per attività VEND CL LIB EE",100678,2033,2030,"Invariata","VEND CL LIB EE","Componenti A e UC","euro","Componenti A e UC","euro","Componenti A e UC","euro"]
["100678.002030.002034","Grandezze monetarie per attività VEND CL LIB EE",100678,2034,2030,"Invariata","VEND CL LIB EE","IVA e imposte","euro","IVA e imposte","euro","IVA e imposte","euro"]
["100678.000000.001046","Grandezze monetarie per attività VEND CL LIB EE",100678,1046,null,"Invariata","VEND CL LIB EE","Punti di prelievo relativi a clienti domestici","euro","Punti di prelievo relativi a clienti domestici","euro","Punti di prelievo relativi a clienti domestici","euro"]
["100678.000000.001047","Grandezze monetarie per attività VEND CL LIB EE",100678,1047,null,"Invariata","VEND CL LIB EE","Punti di prelievo relativi a clienti non domestici - BT altri usi","euro","Punti di prelievo relativi a clienti non domestici - BT altri usi","euro","Punti di prelievo relativi a clienti non domestici - BT altri usi","euro"]
["100678.000000.001048","Grandezze monetarie per attività VEND CL LIB EE",100678,1048,null,"Invariata","VEND CL LIB EE","Punti di prelievo relativi a clienti non domestici - BT ILLUMINAZIONE PUBBLICA","euro","Punti di prelievo relativi a clienti non domestici - BT ILLUMINAZIONE PUBBLICA","euro","Punti di prelievo relativi a clienti non domestici - BT ILLUMINAZIONE PUBBLICA","euro"]
["100678.000000.001049","Grandezze monetarie per attività VEND CL LIB EE",100678,1049,null,"Invariata","VEND CL LIB EE","Punti di prelievo relativi a clienti non domestici - MT altri usi","euro","Punti di prelievo relativi a clienti non domestici - MT altri usi","euro","Punti di prelievo relativi a clienti non domestici - MT altri usi","euro"]
["100678.000000.001050","Grandezze monetarie per attività VEND CL LIB EE",100678,1050,null,"Invariata","VEND CL LIB EE","Punti di prelievo relativi a clienti non domestici - MT ILLUMINAZIONE PUBBLICA","euro","Punti di prelievo relativi a clienti non domestici - MT ILLUMINAZIONE PUBBLICA","euro","Punti di prelievo relativi a clienti non domestici - MT ILLUMINAZIONE PUBBLICA","euro"]
["100678.000000.001051","Grandezze monetarie per attività VEND CL LIB EE",100678,1051,null,"Invariata","VEND CL LIB EE","Punti di prelievo relativi a clienti non domestici - AT","euro","Punti di prelievo relativi a clienti non domestici - AT","euro","Punti di prelievo relativi a clienti non domestici - AT","euro"]
["100678.000000.010625","Grandezze monetarie per attività VEND CL LIB EE",100678,10625,null,"Invariata","VEND CL LIB EE","Punti di prelievo relativi a clienti non domestici - Altissima Tensione","euro","Punti di prelievo relativi a clienti non domestici - Altissima Tensione","euro","Punti di prelievo relativi a clienti non domestici - Altissima Tensione","euro"]
["100092.000000.002030","Grandezze monetarie per attività VEND EE CF MT",100092,2030,null,"Invariata","VEND EE CF MT","Fatturato","euro","Fatturato","euro","Fatturato","euro"]
["100092.002030.002031","Grandezze monetarie per attività VEND EE CF MT",100092,2031,2030,"Invariata","VEND EE CF MT","Ricavi da vendita ","euro","Ricavi da vendita ","euro","Ricavi da vendita ","euro"]
["100092.002030.002032","Grandezze monetarie per attività VEND EE CF MT",100092,2032,2030,"Invariata","VEND EE CF MT","Altre prestanzioni","euro","Altre prestanzioni","euro","Altre prestanzioni","euro"]
["100092.002030.002033","Grandezze monetarie per attività VEND EE CF MT",100092,2033,2030,"Invariata","VEND EE CF MT","Componenti A e UC","euro","Componenti A e UC","euro","Componenti A e UC","euro"]
["100092.002030.002034","Grandezze monetarie per attività VEND EE CF MT",100092,2034,2030,"Invariata","VEND EE CF MT","IVA e imposte","euro","IVA e imposte","euro","IVA e imposte","euro"]
["100092.000000.011095","Grandezze monetarie per attività VEND EE CF MT",100092,11095,null,"Invariata","VEND EE CF MT","Interessi passivi su factoring (come da CE NA)","euro","Interessi passivi su factoring (come da CE NA)","euro","Interessi passivi su factoring (come da CE NA)","euro"]
["100092.011095.012118","Grandezze monetarie per attività VEND EE CF MT",100092,12118,11095,"Invariata","VEND EE CF MT","      di cui ammessi al meccanismo di copertura morosità sisma","euro","      di cui ammessi al meccanismo di copertura morosità sisma","euro","      di cui ammessi al meccanismo di copertura morosità sisma","euro"]
["100092.011095.012119","Grandezze monetarie per attività VEND EE CF MT",100092,12119,11095,"Invariata","VEND EE CF MT","      di cui non ammessi ai meccanismi di reintegrazione morosità","euro","      di cui non ammessi ai meccanismi di reintegrazione morosità","euro","      di cui non ammessi ai meccanismi di reintegrazione morosità","euro"]
["100092.011095.012814","Grandezze monetarie per attività VEND EE CF MT",100092,12814,11095,"Invariata","VEND EE CF MT","      altri interessi passivi su factoring non relativi alla vendita di energia elettrica ai clienti finali in maggior tutela","euro","      altri interessi passivi su factoring non relativi alla vendita di energia elettrica ai clienti finali in maggior tutela","euro","      altri interessi passivi su factoring non relativi alla vendita di energia elettrica ai clienti finali in maggior tutela","euro"]
["100092.000000.001046","Grandezze monetarie per attività VEND EE CF MT",100092,1046,null,"Invariata","VEND EE CF MT","Punti di prelievo relativi a clienti domestici","euro","Punti di prelievo relativi a clienti domestici","euro","Punti di prelievo relativi a clienti domestici","euro"]
["100092.000000.001047","Grandezze monetarie per attività VEND EE CF MT",100092,1047,null,"Invariata","VEND EE CF MT","Punti di prelievo relativi a clienti non domestici - BT altri usi","euro","Punti di prelievo relativi a clienti non domestici - BT altri usi","euro","Punti di prelievo relativi a clienti non domestici - BT altri usi","euro"]
["100092.000000.001048","Grandezze monetarie per attività VEND EE CF MT",100092,1048,null,"Invariata","VEND EE CF MT","Punti di prelievo relativi a clienti non domestici - BT ILLUMINAZIONE PUBBLICA","euro","Punti di prelievo relativi a clienti non domestici - BT ILLUMINAZIONE PUBBLICA","euro","Punti di prelievo relativi a clienti non domestici - BT ILLUMINAZIONE PUBBLICA","euro"]
["100092.000000.001049","Grandezze monetarie per attività VEND EE CF MT",100092,1049,null,"Invariata","VEND EE CF MT","Punti di prelievo relativi a clienti non domestici - MT altri usi","euro","Punti di prelievo relativi a clienti non domestici - MT altri usi","euro","Punti di prelievo relativi a clienti non domestici - MT altri usi","euro"]
["100092.000000.001050","Grandezze monetarie per attività VEND EE CF MT",100092,1050,null,"Invariata","VEND EE CF MT","Punti di prelievo relativi a clienti non domestici - MT ILLUMINAZIONE PUBBLICA","euro","Punti di prelievo relativi a clienti non domestici - MT ILLUMINAZIONE PUBBLICA","euro","Punti di prelievo relativi a clienti non domestici - MT ILLUMINAZIONE PUBBLICA","euro"]
["100092.000000.001051","Grandezze monetarie per attività VEND EE CF MT",100092,1051,null,"Invariata","VEND EE CF MT","Punti di prelievo relativi a clienti non domestici - AT","euro","Punti di prelievo relativi a clienti non domestici - AT","euro","Punti di prelievo relativi a clienti non domestici - AT","euro"]
["100092.000000.010625","Grandezze monetarie per attività VEND EE CF MT",100092,10625,null,"Invariata","VEND EE CF MT","Punti di prelievo relativi a clienti non domestici - Altissima Tensione","euro","Punti di prelievo relativi a clienti non domestici - Altissima Tensione","euro","Punti di prelievo relativi a clienti non domestici - Altissima Tensione","euro"]
["100078.000000.002030","Grandezze monetarie per comparto VEND EE CF MT",100078,2030,null,"Invariata","comparto VEND EE CF MT","Fatturato","euro","Fatturato","euro","Fatturato","euro"]
["100078.002030.002031","Grandezze monetarie per comparto VEND EE CF MT",100078,2031,2030,"Invariata","comparto VEND EE CF MT","Ricavi da vendita ","euro","Ricavi da vendita ","euro","Ricavi da vendita ","euro"]
["100078.002030.002032","Grandezze monetarie per comparto VEND EE CF MT",100078,2032,2030,"Invariata","comparto VEND EE CF MT","Altre prestanzioni","euro","Altre prestanzioni","euro","Altre prestanzioni","euro"]
["100078.002030.002033","Grandezze monetarie per comparto VEND EE CF MT",100078,2033,2030,"Invariata","comparto VEND EE CF MT","Componenti A e UC","euro","Componenti A e UC","euro","Componenti A e UC","euro"]
["100078.002030.002034","Grandezze monetarie per comparto VEND EE CF MT",100078,2034,2030,"Invariata","comparto VEND EE CF MT","IVA e imposte","euro","IVA e imposte","euro","IVA e imposte","euro"]
["100078.000000.011095","Grandezze monetarie per comparto VEND EE CF MT",100078,11095,null,"Invariata","comparto VEND EE CF MT","Interessi passivi su factoring (come da CE NA)","euro","Interessi passivi su factoring (come da CE NA)","euro","Interessi passivi su factoring (come da CE NA)","euro"]
["100078.011095.012118","Grandezze monetarie per comparto VEND EE CF MT",100078,12118,11095,"Invariata","comparto VEND EE CF MT","      di cui ammessi al meccanismo di copertura morosità sisma","euro","      di cui ammessi al meccanismo di copertura morosità sisma","euro","      di cui ammessi al meccanismo di copertura morosità sisma","euro"]
["100078.011095.012119","Grandezze monetarie per comparto VEND EE CF MT",100078,12119,11095,"Invariata","comparto VEND EE CF MT","      di cui non ammessi ai meccanismi di reintegrazione morosità","euro","      di cui non ammessi ai meccanismi di reintegrazione morosità","euro","      di cui non ammessi ai meccanismi di reintegrazione morosità","euro"]
["100078.011095.012814","Grandezze monetarie per comparto VEND EE CF MT",100078,12814,11095,"Invariata","comparto VEND EE CF MT","      altri interessi passivi su factoring non relativi alla vendita di energia elettrica ai clienti finali in maggior tutela","euro","      altri interessi passivi su factoring non relativi alla vendita di energia elettrica ai clienti finali in maggior tutela","euro","      altri interessi passivi su factoring non relativi alla vendita di energia elettrica ai clienti finali in maggior tutela","euro"]
["100078.000000.001046","Grandezze monetarie per comparto VEND EE CF MT",100078,1046,null,"Invariata","comparto VEND EE CF MT","Punti di prelievo relativi a clienti domestici","euro","Punti di prelievo relativi a clienti domestici","euro","Punti di prelievo relativi a clienti domestici","euro"]
["100078.000000.001047","Grandezze monetarie per comparto VEND EE CF MT",100078,1047,null,"Invariata","comparto VEND EE CF MT","Punti di prelievo relativi a clienti non domestici - BT altri usi","euro","Punti di prelievo relativi a clienti non domestici - BT altri usi","euro","Punti di prelievo relativi a clienti non domestici - BT altri usi","euro"]
["100078.000000.001048","Grandezze monetarie per comparto VEND EE CF MT",100078,1048,null,"Invariata","comparto VEND EE CF MT","Punti di prelievo relativi a clienti non domestici - BT ILLUMINAZIONE PUBBLICA","euro","Punti di prelievo relativi a clienti non domestici - BT ILLUMINAZIONE PUBBLICA","euro","Punti di prelievo relativi a clienti non domestici - BT ILLUMINAZIONE PUBBLICA","euro"]
["100078.000000.001049","Grandezze monetarie per comparto VEND EE CF MT",100078,1049,null,"Invariata","comparto VEND EE CF MT","Punti di prelievo relativi a clienti non domestici - MT altri usi","euro","Punti di prelievo relativi a clienti non domestici - MT altri usi","euro","Punti di prelievo relativi a clienti non domestici - MT altri usi","euro"]
["100078.000000.001050","Grandezze monetarie per comparto VEND EE CF MT",100078,1050,null,"Invariata","comparto VEND EE CF MT","Punti di prelievo relativi a clienti non domestici - MT ILLUMINAZIONE PUBBLICA","euro","Punti di prelievo relativi a clienti non domestici - MT ILLUMINAZIONE PUBBLICA","euro","Punti di prelievo relativi a clienti non domestici - MT ILLUMINAZIONE PUBBLICA","euro"]
["100078.000000.001051","Grandezze monetarie per comparto VEND EE CF MT",100078,1051,null,"Invariata","comparto VEND EE CF MT","Punti di prelievo relativi a clienti non domestici - AT","euro","Punti di prelievo relativi a clienti non domestici - AT","euro","Punti di prelievo relativi a clienti non domestici - AT","euro"]
["100078.000000.010625","Grandezze monetarie per comparto VEND EE CF MT",100078,10625,null,"Invariata","comparto VEND EE CF MT","Punti di prelievo relativi a clienti non domestici - Altissima Tensione","euro","Punti di prelievo relativi a clienti non domestici - Altissima Tensione","euro","Punti di prelievo relativi a clienti non domestici - Altissima Tensione","euro"]
["100073.000000.002030","Grandezze monetarie per attività VEND EE CF SG",100073,2030,null,"Invariata","VEND EE CF SG","Fatturato","euro","Fatturato","euro","Fatturato","euro"]
["100073.002030.002031","Grandezze monetarie per attività VEND EE CF SG",100073,2031,2030,"Invariata","VEND EE CF SG","Ricavi da vendita ","euro","Ricavi da vendita ","euro","Ricavi da vendita ","euro"]
["100073.002030.002032","Grandezze monetarie per attività VEND EE CF SG",100073,2032,2030,"Invariata","VEND EE CF SG","Altre prestanzioni","euro","Altre prestanzioni","euro","Altre prestanzioni","euro"]
["100073.002030.002033","Grandezze monetarie per attività VEND EE CF SG",100073,2033,2030,"Invariata","VEND EE CF SG","Componenti A e UC","euro","Componenti A e UC","euro","Componenti A e UC","euro"]
["100073.002030.002034","Grandezze monetarie per attività VEND EE CF SG",100073,2034,2030,"Invariata","VEND EE CF SG","IVA e imposte","euro","IVA e imposte","euro","IVA e imposte","euro"]
["100073.000000.011095","Grandezze monetarie per attività VEND EE CF SG",100073,11095,null,"Invariata","VEND EE CF SG","Interessi passivi su factoring (come da CE NA)","euro","Interessi passivi su factoring (come da CE NA)","euro","Interessi passivi su factoring (come da CE NA)","euro"]
["100073.011095.011084","Grandezze monetarie per attività VEND EE CF SG",100073,11084,11095,"Invariata","VEND EE CF SG","      altri interessi passivi su factoring non relativi alla vendita di energia elettrica ai clienti finali in salvaguardia","euro","      altri interessi passivi su factoring non relativi alla vendita di energia elettrica ai clienti finali in salvaguardia","euro","      altri interessi passivi su factoring non relativi alla vendita di energia elettrica ai clienti finali in salvaguardia","euro"]
["100073.011095.011089","Grandezze monetarie per attività VEND EE CF SG",100073,11089,11095,"Invariata","VEND EE CF SG","      di cui ammessi al meccanismo di reintegrazione salvaguardia","euro","      di cui ammessi al meccanismo di reintegrazione salvaguardia","euro","      di cui ammessi al meccanismo di reintegrazione salvaguardia","euro"]
["100073.011095.012118","Grandezze monetarie per attività VEND EE CF SG",100073,12118,11095,"Invariata","VEND EE CF SG","      di cui ammessi al meccanismo di copertura morosità sisma","euro","      di cui ammessi al meccanismo di copertura morosità sisma","euro","      di cui ammessi al meccanismo di copertura morosità sisma","euro"]
["100073.011095.012119","Grandezze monetarie per attività VEND EE CF SG",100073,12119,11095,"Invariata","VEND EE CF SG","      di cui non ammessi ai meccanismi di reintegrazione morosità","euro","      di cui non ammessi ai meccanismi di reintegrazione morosità","euro","      di cui non ammessi ai meccanismi di reintegrazione morosità","euro"]
["100073.000000.001046","Grandezze monetarie per attività VEND EE CF SG",100073,1046,null,"Invariata","VEND EE CF SG","Punti di prelievo relativi a clienti domestici","euro","Punti di prelievo relativi a clienti domestici","euro","Punti di prelievo relativi a clienti domestici","euro"]
["100073.000000.001047","Grandezze monetarie per attività VEND EE CF SG",100073,1047,null,"Invariata","VEND EE CF SG","Punti di prelievo relativi a clienti non domestici - BT altri usi","euro","Punti di prelievo relativi a clienti non domestici - BT altri usi","euro","Punti di prelievo relativi a clienti non domestici - BT altri usi","euro"]
["100073.000000.001048","Grandezze monetarie per attività VEND EE CF SG",100073,1048,null,"Invariata","VEND EE CF SG","Punti di prelievo relativi a clienti non domestici - BT ILLUMINAZIONE PUBBLICA","euro","Punti di prelievo relativi a clienti non domestici - BT ILLUMINAZIONE PUBBLICA","euro","Punti di prelievo relativi a clienti non domestici - BT ILLUMINAZIONE PUBBLICA","euro"]
["100073.000000.001049","Grandezze monetarie per attività VEND EE CF SG",100073,1049,null,"Invariata","VEND EE CF SG","Punti di prelievo relativi a clienti non domestici - MT altri usi","euro","Punti di prelievo relativi a clienti non domestici - MT altri usi","euro","Punti di prelievo relativi a clienti non domestici - MT altri usi","euro"]
["100073.000000.001050","Grandezze monetarie per attività VEND EE CF SG",100073,1050,null,"Invariata","VEND EE CF SG","Punti di prelievo relativi a clienti non domestici - MT ILLUMINAZIONE PUBBLICA","euro","Punti di prelievo relativi a clienti non domestici - MT ILLUMINAZIONE PUBBLICA","euro","Punti di prelievo relativi a clienti non domestici - MT ILLUMINAZIONE PUBBLICA","euro"]
["100073.000000.001051","Grandezze monetarie per attività VEND EE CF SG",100073,1051,null,"Invariata","VEND EE CF SG","Punti di prelievo relativi a clienti non domestici - AT","euro","Punti di prelievo relativi a clienti non domestici - AT","euro","Punti di prelievo relativi a clienti non domestici - AT","euro"]
["100073.000000.010625","Grandezze monetarie per attività VEND EE CF SG",100073,10625,null,"Invariata","VEND EE CF SG","Punti di prelievo relativi a clienti non domestici - Altissima Tensione","euro","Punti di prelievo relativi a clienti non domestici - Altissima Tensione","euro","Punti di prelievo relativi a clienti non domestici - Altissima Tensione","euro"]
["100074.000000.002030","Grandezze monetarie per comparto VEND EE CF SG",100074,2030,null,"Invariata","comparto VEND EE CF SG","Fatturato","euro","Fatturato","euro","Fatturato","euro"]
["100074.002030.002031","Grandezze monetarie per comparto VEND EE CF SG",100074,2031,2030,"Invariata","comparto VEND EE CF SG","Ricavi da vendita ","euro","Ricavi da vendita ","euro","Ricavi da vendita ","euro"]
["100074.002030.002032","Grandezze monetarie per comparto VEND EE CF SG",100074,2032,2030,"Invariata","comparto VEND EE CF SG","Altre prestanzioni","euro","Altre prestanzioni","euro","Altre prestanzioni","euro"]
["100074.002030.002033","Grandezze monetarie per comparto VEND EE CF SG",100074,2033,2030,"Invariata","comparto VEND EE CF SG","Componenti A e UC","euro","Componenti A e UC","euro","Componenti A e UC","euro"]
[{"$f":"CONCATENATE(TEXT(C67,\"000000\"),\".\",TEXT(E67,\"000000\"),\".\",TEXT(D67,\"000000\"))","v":"100074.002030.002034"},"Grandezze monetarie per comparto VEND EE CF SG",100074,2034,2030,{"$f":"IF(AND(H67=J67,I67=K67),\"Invariata\",IF(H67=\"\",\"Aggiunta\",IF(J67=\"\",\"Eliminata\",\"Modificata\")))","v":"Invariata"},"comparto VEND EE CF SG","IVA e imposte","euro","IVA e imposte","euro","IVA e imposte","euro"]
["100074.000000.011095","Grandezze monetarie per comparto VEND EE CF SG",100074,11095,null,"Invariata","comparto VEND EE CF SG","Interessi passivi su factoring (come da CE NA)","euro","Interessi passivi su factoring (come da CE NA)","euro","Interessi passivi su factoring (come da CE NA)","euro"]
["100074.011095.011084","Grandezze monetarie per comparto VEND EE CF SG",100074,11084,11095,"Invariata","comparto VEND EE CF SG","      altri interessi passivi su factoring non relativi alla vendita di energia elettrica ai clienti finali in salvaguardia","euro","      altri interessi passivi su factoring non relativi alla vendita di energia elettrica ai clienti finali in salvaguardia","euro","      altri interessi passivi su factoring non relativi alla vendita di energia elettrica ai clienti finali in salvaguardia","euro"]
["100074.011095.011089","Grandezze monetarie per comparto VEND EE CF SG",100074,11089,11095,"Invariata","comparto VEND EE CF SG","      di cui ammessi al meccanismo di reintegrazione salvaguardia","euro","      di cui ammessi al meccanismo di reintegrazione salvaguardia","euro","      di cui ammessi al meccanismo di reintegrazione salvaguardia","euro"]
["100074.011095.012118","Grandezze monetarie per comparto VEND EE CF SG",100074,12118,11095,"Invariata","comparto VEND EE CF SG","      di cui ammessi al meccanismo di copertura morosità sisma","euro","      di cui ammessi al meccanismo di copertura morosità sisma","euro","      di cui ammessi al meccanismo di copertura morosità sisma","euro"]
["100074.011095.012119","Grandezze monetarie per comparto VEND EE CF SG",100074,12119,11095,"Invariata","comparto VEND EE CF SG","      di cui non ammessi ai meccanismi di reintegrazione morosità","euro","      di cui non ammessi ai meccanismi di reintegrazione morosità","euro","      di cui non ammessi ai meccanismi di reintegrazione morosità","euro"]
["100074.000000.001046","Grandezze monetarie per comparto VEND EE CF SG",100074,1046,null,"Invariata","comparto VEND EE CF SG","Punti di prelievo relativi a clienti domestici","euro","Punti di prelievo relativi a clienti domestici","euro","Punti di prelievo relativi a clienti domestici","euro"]
["100074.000000.001047","Grandezze monetarie per comparto VEND EE CF SG",100074,1047,null,"Invariata","comparto VEND EE CF SG","Punti di prelievo relativi a clienti non domestici - BT altri usi","euro","Punti di prelievo relativi a clienti non domestici - BT altri usi","euro","Punti di prelievo relativi a clienti non domestici - BT altri usi","euro"]
["100074.000000.001048","Grandezze monetarie per comparto VEND EE CF SG",100074,1048,null,"Invariata","comparto VEND EE CF SG","Punti di prelievo relativi a clienti non domestici - BT ILLUMINAZIONE PUBBLICA","euro","Punti di prelievo relativi a clienti non domestici - BT ILLUMINAZIONE PUBBLICA","euro","Punti di prelievo relativi a clienti non domestici - BT ILLUMINAZIONE PUBBLICA","euro"]
["100074.000000.001049","Grandezze monetarie per comparto VEND EE CF SG",100074,1049,null,"Invariata","comparto VEND EE CF SG","Punti di prelievo relativi a clienti non domestici - MT altri usi","euro","Punti di prelievo relativi a clienti non domestici - MT altri usi","euro","Punti di prelievo relativi a clienti non domestici - MT altri usi","euro"]
["100074.000000.001050","Grandezze monetarie per comparto VEND EE CF SG",100074,1050,null,"Invariata","comparto VEND EE CF SG","Punti di prelievo relativi a clienti non domestici - MT ILLUMINAZIONE PUBBLICA","euro","Punti di prelievo relativi a clienti non domestici - MT ILLUMINAZIONE PUBBLICA","euro","Punti di prelievo relativi a clienti non domestici - MT ILLUMINAZIONE PUBBLICA","euro"]
["100074.000000.001051","Grandezze monetarie per comparto VEND EE CF SG",100074,1051,null,"Invariata","comparto VEND EE CF SG","Punti di prelievo relativi a clienti non domestici - AT","euro","Punti di prelievo relativi a clienti non domestici - AT","euro","Punti di prelievo relativi a clienti non domestici - AT","euro"]
["100074.000000.010625","Grandezze monetarie per comparto VEND EE CF SG",100074,10625,null,"Invariata","comparto VEND EE CF SG","Punti di prelievo relativi a clienti non domestici - Altissima Tensione","euro","Punti di prelievo relativi a clienti non domestici - Altissima Tensione","euro","Punti di prelievo relativi a clienti non domestici - Altissima Tensione","euro"]
["102914.000000.002030","Grandezze monetarie per attività VEND EE CF TG",102914,2030,null,"Eliminata","VEND EE CF TG","Fatturato","euro"]
["102914.002030.002031","Grandezze monetarie per attività VEND EE CF TG",102914,2031,2030,"Eliminata","VEND EE CF TG","Ricavi da vendita ","euro"]
["102914.002030.002032","Grandezze monetarie per attività VEND EE CF TG",102914,2032,2030,"Eliminata","VEND EE CF TG","Altre prestanzioni","euro"]
["102914.002030.002033","Grandezze monetarie per attività VEND EE CF TG",102914,2033,2030,"Eliminata","VEND EE CF TG","Componenti A e UC","euro"]
["102914.002030.002034","Grandezze monetarie per attività VEND EE CF TG",102914,2034,2030,"Eliminata","VEND EE CF TG","IVA e imposte","euro"]
["102914.000000.011095","Grandezze monetarie per attività VEND EE CF TG",102914,11095,null,"Eliminata","VEND EE CF TG","Interessi passivi su factoring (come da CE NA)","euro"]
["102914.011095.011084","Grandezze monetarie per attività VEND EE CF TG",102914,11084,11095,"Eliminata","VEND EE CF TG","      altri interessi passivi su factoring non relativi alla vendita di energia elettrica ai clienti finali in salvaguardia","euro"]
["102914.011095.011089","Grandezze monetarie per attività VEND EE CF TG",102914,11089,11095,"Eliminata","VEND EE CF TG","      di cui ammessi al meccanismo di reintegrazione salvaguardia","euro"]
["102914.011095.012118","Grandezze monetarie per attività VEND EE CF TG",102914,12118,11095,"Eliminata","VEND EE CF TG","      di cui ammessi al meccanismo di copertura morosità sisma","euro"]
["102914.011095.012119","Grandezze monetarie per attività VEND EE CF TG",102914,12119,11095,"Eliminata","VEND EE CF TG","      di cui non ammessi ai meccanismi di reintegrazione morosità","euro"]
["102914.000000.001046","Grandezze monetarie per attività VEND EE CF TG",102914,1046,null,"Eliminata","VEND EE CF TG","Punti di prelievo relativi a clienti domestici","euro"]
["102914.000000.001047","Grandezze monetarie per attività VEND EE CF TG",102914,1047,null,"Eliminata","VEND EE CF TG","Punti di prelievo relativi a clienti non domestici - BT altri usi","euro"]
["102914.000000.001048","Grandezze monetarie per attività VEND EE CF TG",102914,1048,null,"Eliminata","VEND EE CF TG","Punti di prelievo relativi a clienti non domestici - BT ILLUMINAZIONE PUBBLICA","euro"]
["102914.000000.001049","Grandezze monetarie per attività VEND EE CF TG",102914,1049,null,"Eliminata","VEND EE CF TG","Punti di prelievo relativi a clienti non domestici - MT altri usi","euro"]
["102914.000000.001050","Grandezze monetarie per attività VEND EE CF TG",102914,1050,null,"Eliminata","VEND EE CF TG","Punti di prelievo relativi a clienti non domestici - MT ILLUMINAZIONE PUBBLICA","euro"]
["102914.000000.001051","Grandezze monetarie per attività VEND EE CF TG",102914,1051,null,"Eliminata","VEND EE CF TG","Punti di prelievo relativi a clienti non domestici - AT","euro"]
["102914.000000.010625","Grandezze monetarie per attività VEND EE CF TG",102914,10625,null,"Eliminata","VEND EE CF TG","Punti di prelievo relativi a clienti non domestici - Altissima Tensione","euro"]
["102939.000000.002030","Grandezze monetarie per comparto VEND EE CF TG",102939,2030,null,"Eliminata","comparto VEND EE CF TG","Fatturato","euro"]
["102939.002030.002031","Grandezze monetarie per comparto VEND EE CF TG",102939,2031,2030,"Eliminata","comparto VEND EE CF TG","Ricavi da vendita ","euro"]
["102939.002030.002032","Grandezze monetarie per comparto VEND EE CF TG",102939,2032,2030,"Eliminata","comparto VEND EE CF TG","Altre prestanzioni","euro"]
["102939.002030.002033","Grandezze monetarie per comparto VEND EE CF TG",102939,2033,2030,"Eliminata","comparto VEND EE CF TG","Componenti A e UC","euro"]
["102939.002030.002034","Grandezze monetarie per comparto VEND EE CF TG",102939,2034,2030,"Eliminata","comparto VEND EE CF TG","IVA e imposte","euro"]
["102939.000000.011095","Grandezze monetarie per comparto VEND EE CF TG",102939,11095,null,"Eliminata","comparto VEND EE CF TG","Interessi passivi su factoring (come da CE NA)","euro"]
["102939.011095.011084","Grandezze monetarie per comparto VEND EE CF TG",102939,11084,11095,"Eliminata","comparto VEND EE CF TG","      altri interessi passivi su factoring non relativi alla vendita di energia elettrica ai clienti finali in salvaguardia","euro"]
["102939.011095.011089","Grandezze monetarie per comparto VEND EE CF TG",102939,11089,11095,"Eliminata","comparto VEND EE CF TG","      di cui ammessi al meccanismo di reintegrazione salvaguardia","euro"]
["102939.011095.012118","Grandezze monetarie per comparto VEND EE CF TG",102939,12118,11095,"Eliminata","comparto VEND EE CF TG","      di cui ammessi al meccanismo di copertura morosità sisma","euro"]
["102939.011095.012119","Grandezze monetarie per comparto VEND EE CF TG",102939,12119,11095,"Eliminata","comparto VEND EE CF TG","      di cui non ammessi ai meccanismi di reintegrazione morosità","euro"]
["102939.000000.001046","Grandezze monetarie per comparto VEND EE CF TG",102939,1046,null,"Eliminata","comparto VEND EE CF TG","Punti di prelievo relativi a clienti domestici","euro"]
["102939.000000.001047","Grandezze monetarie per comparto VEND EE CF TG",102939,1047,null,"Eliminata","comparto VEND EE CF TG","Punti di prelievo relativi a clienti non domestici - BT altri usi","euro"]
["102939.000000.001048","Grandezze monetarie per comparto VEND EE CF TG",102939,1048,null,"Eliminata","comparto VEND EE CF TG","Punti di prelievo relativi a clienti non domestici - BT ILLUMINAZIONE PUBBLICA","euro"]
["102939.000000.001049","Grandezze monetarie per comparto VEND EE CF TG",102939,1049,null,"Eliminata","comparto VEND EE CF TG","Punti di prelievo relativi a clienti non domestici - MT altri usi","euro"]
["102939.000000.001050","Grandezze monetarie per comparto VEND EE CF TG",102939,1050,null,"Eliminata","comparto VEND EE CF TG","Punti di prelievo relativi a clienti non domestici - MT ILLUMINAZIONE PUBBLICA","euro"]
["102939.000000.001051","Grandezze monetarie per comparto VEND EE CF TG",102939,1051,null,"Eliminata","comparto VEND EE CF TG","Punti di prelievo relativi a clienti non domestici - AT","euro"]
["102939.000000.010625","Grandezze monetarie per comparto VEND EE CF TG",102939,10625,null,"Eliminata","comparto VEND EE CF TG","Punti di prelievo relativi a clienti non domestici - Altissima Tensione","euro"]
["102972.000000.002030","Grandezze monetarie per attività VEND EE CF TG PI",102972,2030,null,"Invariata","VEND EE CF TG PI","Fatturato","euro","Fatturato","euro","Fatturato","euro"]
["102972.002030.002031","Grandezze monetarie per attività VEND EE CF TG PI",102972,2031,2030,"Invariata","VEND EE CF TG PI","Ricavi da vendita ","euro","Ricavi da vendita ","euro","Ricavi da vendita ","euro"]
["102972.002030.002032","Grandezze monetarie per attività VEND EE CF TG PI",102972,2032,2030,"Invariata","VEND EE CF TG PI","Altre prestanzioni","euro","Altre prestanzioni","euro","Altre prestanzioni","euro"]
["102972.002030.002033","Grandezze monetarie per attività VEND EE CF TG PI",102972,2033,2030,"Invariata","VEND EE CF TG PI","Componenti A e UC","euro","Componenti A e UC","euro","Componenti A e UC","euro"]
["102972.002030.002034","Grandezze monetarie per attività VEND EE CF TG PI",102972,2034,2030,"Invariata","VEND EE CF TG PI","IVA e imposte","euro","IVA e imposte","euro","IVA e imposte","euro"]
["102972.000000.011095","Grandezze monetarie per attività VEND EE CF TG PI",102972,11095,null,"Invariata","VEND EE CF TG PI","Interessi passivi su factoring (come da CE NA)","euro","Interessi passivi su factoring (come da CE NA)","euro","Interessi passivi su factoring (come da CE NA)","euro"]
["102972.011095.011084","Grandezze monetarie per attività VEND EE CF TG PI",102972,11084,11095,"Invariata","VEND EE CF TG PI","      altri interessi passivi su factoring non relativi alla vendita di energia elettrica ai clienti finali in salvaguardia","euro","      altri interessi passivi su factoring non relativi alla vendita di energia elettrica ai clienti finali in salvaguardia","euro","      altri interessi passivi su factoring non relativi alla vendita di energia elettrica ai clienti finali in salvaguardia","euro"]
["102972.011095.011089","Grandezze monetarie per attività VEND EE CF TG PI",102972,11089,11095,"Invariata","VEND EE CF TG PI","      di cui ammessi al meccanismo di reintegrazione salvaguardia","euro","      di cui ammessi al meccanismo di reintegrazione salvaguardia","euro","      di cui ammessi al meccanismo di reintegrazione salvaguardia","euro"]
["102972.011095.012118","Grandezze monetarie per attività VEND EE CF TG PI",102972,12118,11095,"Invariata","VEND EE CF TG PI","      di cui ammessi al meccanismo di copertura morosità sisma","euro","      di cui ammessi al meccanismo di copertura morosità sisma","euro","      di cui ammessi al meccanismo di copertura morosità sisma","euro"]
["102972.011095.012119","Grandezze monetarie per attività VEND EE CF TG PI",102972,12119,11095,"Invariata","VEND EE CF TG PI","      di cui non ammessi ai meccanismi di reintegrazione morosità","euro","      di cui non ammessi ai meccanismi di reintegrazione morosità","euro","      di cui non ammessi ai meccanismi di reintegrazione morosità","euro"]
["102972.000000.001046","Grandezze monetarie per attività VEND EE CF TG PI",102972,1046,null,"Invariata","VEND EE CF TG PI","Punti di prelievo relativi a clienti domestici","euro","Punti di prelievo relativi a clienti domestici","euro","Punti di prelievo relativi a clienti domestici","euro"]
["102972.000000.001047","Grandezze monetarie per attività VEND EE CF TG PI",102972,1047,null,"Invariata","VEND EE CF TG PI","Punti di prelievo relativi a clienti non domestici - BT altri usi","euro","Punti di prelievo relativi a clienti non domestici - BT altri usi","euro","Punti di prelievo relativi a clienti non domestici - BT altri usi","euro"]
["102972.000000.001048","Grandezze monetarie per attività VEND EE CF TG PI",102972,1048,null,"Invariata","VEND EE CF TG PI","Punti di prelievo relativi a clienti non domestici - BT ILLUMINAZIONE PUBBLICA","euro","Punti di prelievo relativi a clienti non domestici - BT ILLUMINAZIONE PUBBLICA","euro","Punti di prelievo relativi a clienti non domestici - BT ILLUMINAZIONE PUBBLICA","euro"]
["102972.000000.001049","Grandezze monetarie per attività VEND EE CF TG PI",102972,1049,null,"Invariata","VEND EE CF TG PI","Punti di prelievo relativi a clienti non domestici - MT altri usi","euro","Punti di prelievo relativi a clienti non domestici - MT altri usi","euro","Punti di prelievo relativi a clienti non domestici - MT altri usi","euro"]
["102972.000000.001050","Grandezze monetarie per attività VEND EE CF TG PI",102972,1050,null,"Invariata","VEND EE CF TG PI","Punti di prelievo relativi a clienti non domestici - MT ILLUMINAZIONE PUBBLICA","euro","Punti di prelievo relativi a clienti non domestici - MT ILLUMINAZIONE PUBBLICA","euro","Punti di prelievo relativi a clienti non domestici - MT ILLUMINAZIONE PUBBLICA","euro"]
["102972.000000.001051","Grandezze monetarie per attività VEND EE CF TG PI",102972,1051,null,"Invariata","VEND EE CF TG PI","Punti di prelievo relativi a clienti non domestici - AT","euro","Punti di prelievo relativi a clienti non domestici - AT","euro","Punti di prelievo relativi a clienti non domestici - AT","euro"]
["102972.000000.010625","Grandezze monetarie per attività VEND EE CF TG PI",102972,10625,null,"Invariata","VEND EE CF TG PI","Punti di prelievo relativi a clienti non domestici - Altissima Tensione","euro","Punti di prelievo relativi a clienti non domestici - Altissima Tensione","euro","Punti di prelievo relativi a clienti non domestici - Altissima Tensione","euro"]
[{"$f":"CONCATENATE(TEXT(C131,\"000000\"),\".\",TEXT(E131,\"000000\"),\".\",TEXT(D131,\"000000\"))","v":"102997.000000.002030"},"Grandezze monetarie per comparto VEND EE CF TG PI",102997,2030,null,{"$f":"IF(AND(H131=J131,I131=K131),\"Invariata\",IF(H131=\"\",\"Aggiunta\",IF(J131=\"\",\"Eliminata\",\"Modificata\")))","v":"Invariata"},"VEND EE CF TG PI","Fatturato","euro","Fatturato","euro","Fatturato","euro"]
["102997.002030.002031","Grandezze monetarie per comparto VEND EE CF TG PI",102997,2031,2030,"Invariata","VEND EE CF TG PI","Ricavi da vendita ","euro","Ricavi da vendita ","euro","Ricavi da vendita ","euro"]
["102997.002030.002032","Grandezze monetarie per comparto VEND EE CF TG PI",102997,2032,2030,"Invariata","VEND EE CF TG PI","Altre prestanzioni","euro","Altre prestanzioni","euro","Altre prestanzioni","euro"]
["102997.002030.002033","Grandezze monetarie per comparto VEND EE CF TG PI",102997,2033,2030,"Invariata","VEND EE CF TG PI","Componenti A e UC","euro","Componenti A e UC","euro","Componenti A e UC","euro"]
["102997.002030.002034","Grandezze monetarie per comparto VEND EE CF TG PI",102997,2034,2030,"Invariata","VEND EE CF TG PI","IVA e imposte","euro","IVA e imposte","euro","IVA e imposte","euro"]
["102997.000000.011095","Grandezze monetarie per comparto VEND EE CF TG PI",102997,11095,null,"Invariata","VEND EE CF TG PI","Interessi passivi su factoring (come da CE NA)","euro","Interessi passivi su factoring (come da CE NA)","euro","Interessi passivi su factoring (come da CE NA)","euro"]
["102997.011095.011084","Grandezze monetarie per comparto VEND EE CF TG PI",102997,11084,11095,"Invariata","VEND EE CF TG PI","      altri interessi passivi su factoring non relativi alla vendita di energia elettrica ai clienti finali in salvaguardia","euro","      altri interessi passivi su factoring non relativi alla vendita di energia elettrica ai clienti finali in salvaguardia","euro","      altri interessi passivi su factoring non relativi alla vendita di energia elettrica ai clienti finali in salvaguardia","euro"]
["102997.011095.011089","Grandezze monetarie per comparto VEND EE CF TG PI",102997,11089,11095,"Invariata","VEND EE CF TG PI","      di cui ammessi al meccanismo di reintegrazione salvaguardia","euro","      di cui ammessi al meccanismo di reintegrazione salvaguardia","euro","      di cui ammessi al meccanismo di reintegrazione salvaguardia","euro"]
["102997.011095.012118","Grandezze monetarie per comparto VEND EE CF TG PI",102997,12118,11095,"Invariata","VEND EE CF TG PI","      di cui ammessi al meccanismo di copertura morosità sisma","euro","      di cui ammessi al meccanismo di copertura morosità sisma","euro","      di cui ammessi al meccanismo di copertura morosità sisma","euro"]
["102997.011095.012119","Grandezze monetarie per comparto VEND EE CF TG PI",102997,12119,11095,"Invariata","VEND EE CF TG PI","      di cui non ammessi ai meccanismi di reintegrazione morosità","euro","      di cui non ammessi ai meccanismi di reintegrazione morosità","euro","      di cui non ammessi ai meccanismi di reintegrazione morosità","euro"]
["102997.000000.001046","Grandezze monetarie per comparto VEND EE CF TG PI",102997,1046,null,"Invariata","VEND EE CF TG PI","Punti di prelievo relativi a clienti domestici","euro","Punti di prelievo relativi a clienti domestici","euro","Punti di prelievo relativi a clienti domestici","euro"]
["102997.000000.001047","Grandezze monetarie per comparto VEND EE CF TG PI",102997,1047,null,"Invariata","VEND EE CF TG PI","Punti di prelievo relativi a clienti non domestici - BT altri usi","euro","Punti di prelievo relativi a clienti non domestici - BT altri usi","euro","Punti di prelievo relativi a clienti non domestici - BT altri usi","euro"]
["102997.000000.001048","Grandezze monetarie per comparto VEND EE CF TG PI",102997,1048,null,"Invariata","VEND EE CF TG PI","Punti di prelievo relativi a clienti non domestici - BT ILLUMINAZIONE PUBBLICA","euro","Punti di prelievo relativi a clienti non domestici - BT ILLUMINAZIONE PUBBLICA","euro","Punti di prelievo relativi a clienti non domestici - BT ILLUMINAZIONE PUBBLICA","euro"]
["102997.000000.001049","Grandezze monetarie per comparto VEND EE CF TG PI",102997,1049,null,"Invariata","VEND EE CF TG PI","Punti di prelievo relativi a clienti non domestici - MT altri usi","euro","Punti di prelievo relativi a clienti non domestici - MT altri usi","euro","Punti di prelievo relativi a clienti non domestici - MT altri usi","euro"]
["102997.000000.001050","Grandezze monetarie per comparto VEND EE CF TG PI",102997,1050,null,"Invariata","VEND EE CF TG PI","Punti di prelievo relativi a clienti non domestici - MT ILLUMINAZIONE PUBBLICA","euro","Punti di prelievo relativi a clienti non domestici - MT ILLUMINAZIONE PUBBLICA","euro","Punti di prelievo relativi a clienti non domestici - MT ILLUMINAZIONE PUBBLICA","euro"]
["102997.000000.001051","Grandezze monetarie per comparto VEND EE CF TG PI",102997,1051,null,"Invariata","VEND EE CF TG PI","Punti di prelievo relativi a clienti non domestici - AT","euro","Punti di prelievo relativi a clienti non domestici - AT","euro","Punti di prelievo relativi a clienti non domestici - AT","euro"]
["102997.000000.010625","Grandezze monetarie per comparto VEND EE CF TG PI",102997,10625,null,"Invariata","VEND EE CF TG PI","Punti di prelievo relativi a clienti non domestici - Altissima Tensione","euro","Punti di prelievo relativi a clienti non domestici - Altissima Tensione","euro","Punti di prelievo relativi a clienti non domestici - Altissima Tensione","euro"]
["103016.000000.002030","Grandezze monetarie per attività VEND EE CF TG MI",103016,2030,null,"Invariata","VEND EE CF TG MI","Fatturato","euro","Fatturato","euro","Fatturato","euro"]
["103016.002030.002031","Grandezze monetarie per attività VEND EE CF TG MI",103016,2031,2030,"Invariata","VEND EE CF TG MI","Ricavi da vendita ","euro","Ricavi da vendita ","euro","Ricavi da vendita ","euro"]
["103016.002030.002032","Grandezze monetarie per attività VEND EE CF TG MI",103016,2032,2030,"Invariata","VEND EE CF TG MI","Altre prestanzioni","euro","Altre prestanzioni","euro","Altre prestanzioni","euro"]
["103016.002030.002033","Grandezze monetarie per attività VEND EE CF TG MI",103016,2033,2030,"Invariata","VEND EE CF TG MI","Componenti A e UC","euro","Componenti A e UC","euro","Componenti A e UC","euro"]
["103016.002030.002034","Grandezze monetarie per attività VEND EE CF TG MI",103016,2034,2030,"Invariata","VEND EE CF TG MI","IVA e imposte","euro","IVA e imposte","euro","IVA e imposte","euro"]
["103016.000000.011095","Grandezze monetarie per attività VEND EE CF TG MI",103016,11095,null,"Invariata","VEND EE CF TG MI","Interessi passivi su factoring (come da CE NA)","euro","Interessi passivi su factoring (come da CE NA)","euro","Interessi passivi su factoring (come da CE NA)","euro"]
["103016.011095.012118","Grandezze monetarie per attività VEND EE CF TG MI",103016,12118,11095,"Invariata","VEND EE CF TG MI","      di cui ammessi al meccanismo di copertura morosità sisma","euro","      di cui ammessi al meccanismo di copertura morosità sisma","euro","      di cui ammessi al meccanismo di copertura morosità sisma","euro"]
["103016.011095.012119","Grandezze monetarie per attività VEND EE CF TG MI",103016,12119,11095,"Invariata","VEND EE CF TG MI","      di cui non ammessi ai meccanismi di reintegrazione morosità","euro","      di cui non ammessi ai meccanismi di reintegrazione morosità","euro","      di cui non ammessi ai meccanismi di reintegrazione morosità","euro"]
["103016.000000.001046","Grandezze monetarie per attività VEND EE CF TG MI",103016,1046,null,"Invariata","VEND EE CF TG MI","Punti di prelievo relativi a clienti domestici","euro","Punti di prelievo relativi a clienti domestici","euro","Punti di prelievo relativi a clienti domestici","euro"]
["103016.000000.001047","Grandezze monetarie per attività VEND EE CF TG MI",103016,1047,null,"Invariata","VEND EE CF TG MI","Punti di prelievo relativi a clienti non domestici - BT altri usi","euro","Punti di prelievo relativi a clienti non domestici - BT altri usi","euro","Punti di prelievo relativi a clienti non domestici - BT altri usi","euro"]
["103016.000000.001048","Grandezze monetarie per attività VEND EE CF TG MI",103016,1048,null,"Invariata","VEND EE CF TG MI","Punti di prelievo relativi a clienti non domestici - BT ILLUMINAZIONE PUBBLICA","euro","Punti di prelievo relativi a clienti non domestici - BT ILLUMINAZIONE PUBBLICA","euro","Punti di prelievo relativi a clienti non domestici - BT ILLUMINAZIONE PUBBLICA","euro"]
["103016.000000.001049","Grandezze monetarie per attività VEND EE CF TG MI",103016,1049,null,"Invariata","VEND EE CF TG MI","Punti di prelievo relativi a clienti non domestici - MT altri usi","euro","Punti di prelievo relativi a clienti non domestici - MT altri usi","euro","Punti di prelievo relativi a clienti non domestici - MT altri usi","euro"]
["103016.000000.001050","Grandezze monetarie per attività VEND EE CF TG MI",103016,1050,null,"Invariata","VEND EE CF TG MI","Punti di prelievo relativi a clienti non domestici - MT ILLUMINAZIONE PUBBLICA","euro","Punti di prelievo relativi a clienti non domestici - MT ILLUMINAZIONE PUBBLICA","euro","Punti di prelievo relativi a clienti non domestici - MT ILLUMINAZIONE PUBBLICA","euro"]
["103016.000000.001051","Grandezze monetarie per attività VEND EE CF TG MI",103016,1051,null,"Invariata","VEND EE CF TG MI","Punti di prelievo relativi a clienti non domestici - AT","euro","Punti di prelievo relativi a clienti non domestici - AT","euro","Punti di prelievo relativi a clienti non domestici - AT","euro"]
["103016.000000.010625","Grandezze monetarie per attività VEND EE CF TG MI",103016,10625,null,"Invariata","VEND EE CF TG MI","Punti di prelievo relativi a clienti non domestici - Altissima Tensione","euro","Punti di prelievo relativi a clienti non domestici - Altissima Tensione","euro","Punti di prelievo relativi a clienti non domestici - Altissima Tensione","euro"]
["103041.000000.002030","Grandezze monetarie per comparto VEND EE CF TG MI",103041,2030,null,"Invariata","VEND EE CF TG MI","Fatturato","euro","Fatturato","euro","Fatturato","euro"]
["103041.002030.002031","Grandezze monetarie per comparto VEND EE CF TG MI",103041,2031,2030,"Invariata","VEND EE CF TG MI","Ricavi da vendita ","euro","Ricavi da vendita ","euro","Ricavi da vendita ","euro"]
["103041.002030.002032","Grandezze monetarie per comparto VEND EE CF TG MI",103041,2032,2030,"Invariata","VEND EE CF TG MI","Altre prestanzioni","euro","Altre prestanzioni","euro","Altre prestanzioni","euro"]
["103041.002030.002033","Grandezze monetarie per comparto VEND EE CF TG MI",103041,2033,2030,"Invariata","VEND EE CF TG MI","Componenti A e UC","euro","Componenti A e UC","euro","Componenti A e UC","euro"]
["103041.002030.002034","Grandezze monetarie per comparto VEND EE CF TG MI",103041,2034,2030,"Invariata","VEND EE CF TG MI","IVA e imposte","euro","IVA e imposte","euro","IVA e imposte","euro"]
["103041.000000.011095","Grandezze monetarie per comparto VEND EE CF TG MI",103041,11095,null,"Invariata","VEND EE CF TG MI","Interessi passivi su factoring (come da CE NA)","euro","Interessi passivi su factoring (come da CE NA)","euro","Interessi passivi su factoring (come da CE NA)","euro"]
["103041.011095.012118","Grandezze monetarie per comparto VEND EE CF TG MI",103041,12118,11095,"Invariata","VEND EE CF TG MI","      di cui ammessi al meccanismo di copertura morosità sisma","euro","      di cui ammessi al meccanismo di copertura morosità sisma","euro","      di cui ammessi al meccanismo di copertura morosità sisma","euro"]
["103041.011095.012119","Grandezze monetarie per comparto VEND EE CF TG MI",103041,12119,11095,"Invariata","VEND EE CF TG MI","      di cui non ammessi ai meccanismi di reintegrazione morosità","euro","      di cui non ammessi ai meccanismi di reintegrazione morosità","euro","      di cui non ammessi ai meccanismi di reintegrazione morosità","euro"]
["103041.000000.001046","Grandezze monetarie per comparto VEND EE CF TG MI",103041,1046,null,"Invariata","VEND EE CF TG MI","Punti di prelievo relativi a clienti domestici","euro","Punti di prelievo relativi a clienti domestici","euro","Punti di prelievo relativi a clienti domestici","euro"]
["103041.000000.001047","Grandezze monetarie per comparto VEND EE CF TG MI",103041,1047,null,"Invariata","VEND EE CF TG MI","Punti di prelievo relativi a clienti non domestici - BT altri usi","euro","Punti di prelievo relativi a clienti non domestici - BT altri usi","euro","Punti di prelievo relativi a clienti non domestici - BT altri usi","euro"]
["103041.000000.001048","Grandezze monetarie per comparto VEND EE CF TG MI",103041,1048,null,"Invariata","VEND EE CF TG MI","Punti di prelievo relativi a clienti non domestici - BT ILLUMINAZIONE PUBBLICA","euro","Punti di prelievo relativi a clienti non domestici - BT ILLUMINAZIONE PUBBLICA","euro","Punti di prelievo relativi a clienti non domestici - BT ILLUMINAZIONE PUBBLICA","euro"]
["103041.000000.001049","Grandezze monetarie per comparto VEND EE CF TG MI",103041,1049,null,"Invariata","VEND EE CF TG MI","Punti di prelievo relativi a clienti non domestici - MT altri usi","euro","Punti di prelievo relativi a clienti non domestici - MT altri usi","euro","Punti di prelievo relativi a clienti non domestici - MT altri usi","euro"]
["103041.000000.001050","Grandezze monetarie per comparto VEND EE CF TG MI",103041,1050,null,"Invariata","VEND EE CF TG MI","Punti di prelievo relativi a clienti non domestici - MT ILLUMINAZIONE PUBBLICA","euro","Punti di prelievo relativi a clienti non domestici - MT ILLUMINAZIONE PUBBLICA","euro","Punti di prelievo relativi a clienti non domestici - MT ILLUMINAZIONE PUBBLICA","euro"]
["103041.000000.001051","Grandezze monetarie per comparto VEND EE CF TG MI",103041,1051,null,"Invariata","VEND EE CF TG MI","Punti di prelievo relativi a clienti non domestici - AT","euro","Punti di prelievo relativi a clienti non domestici - AT","euro","Punti di prelievo relativi a clienti non domestici - AT","euro"]
["103041.000000.010625","Grandezze monetarie per comparto VEND EE CF TG MI",103041,10625,null,"Invariata","VEND EE CF TG MI","Punti di prelievo relativi a clienti non domestici - Altissima Tensione","euro","Punti di prelievo relativi a clienti non domestici - Altissima Tensione","euro","Punti di prelievo relativi a clienti non domestici - Altissima Tensione","euro"]
["100713.000000.002030","Grandezze monetarie per attività DIST GAS DIV",100713,2030,null,"Invariata","DIST GAS DIV","Fatturato","euro","Fatturato","euro","Fatturato","euro"]
["100713.000000.011098","Grandezze monetarie per attività DIST GAS DIV",100713,11098,null,"Invariata","DIST GAS DIV","Ricavi di vendita di gas a prezzi liberi a mezzo reti canalizzate","euro","Ricavi di vendita di gas a prezzi liberi a mezzo reti canalizzate","euro","Ricavi di vendita di gas a prezzi liberi a mezzo reti canalizzate","euro"]
["100713.000000.010627","Grandezze monetarie per attività DIST GAS DIV",100713,10627,null,"Invariata","DIST GAS DIV","Clienti attivi - Totale fatturato nell'anno","euro","Clienti attivi - Totale fatturato nell'anno","euro","Clienti attivi - Totale fatturato nell'anno","euro"]
["100713.000000.011096","Grandezze monetarie per attività DIST GAS DIV",100713,11096,null,"Invariata","DIST GAS DIV","IVA sui ricavi di vendita di gas a prezzi liberi a mezzo reti canalizzate","euro","IVA sui ricavi di vendita di gas a prezzi liberi a mezzo reti canalizzate","euro","IVA sui ricavi di vendita di gas a prezzi liberi a mezzo reti canalizzate","euro"]
["100713.000000.011099","Grandezze monetarie per attività DIST GAS DIV",100713,11099,null,"Invariata","DIST GAS DIV","Ricavi di vendita di gas a prezzi regolati a mezzo reti canalizzate","euro","Ricavi di vendita di gas a prezzi regolati a mezzo reti canalizzate","euro","Ricavi di vendita di gas a prezzi regolati a mezzo reti canalizzate","euro"]
["100713.000000.011094","Grandezze monetarie per attività DIST GAS DIV",100713,11094,null,"Invariata","DIST GAS DIV","Imposte sui ricavi di vendita di gas a prezzi regolati a mezzo reti canalizzate","euro","Imposte sui ricavi di vendita di gas a prezzi regolati a mezzo reti canalizzate","euro","Imposte sui ricavi di vendita di gas a prezzi regolati a mezzo reti canalizzate","euro"]
["100713.000000.011097","Grandezze monetarie per attività DIST GAS DIV",100713,11097,null,"Invariata","DIST GAS DIV","IVA sui ricavi di vendita di gas a prezzi regolati a mezzo reti canalizzate","euro","IVA sui ricavi di vendita di gas a prezzi regolati a mezzo reti canalizzate","euro","IVA sui ricavi di vendita di gas a prezzi regolati a mezzo reti canalizzate","euro"]
["100713.000000.011093","Grandezze monetarie per attività DIST GAS DIV",100713,11093,null,"Invariata","DIST GAS DIV","Imposte sui ricavi di vendita di gas a prezzi liberi a mezzo reti canalizzate","euro","Imposte sui ricavi di vendita di gas a prezzi liberi a mezzo reti canalizzate","euro","Imposte sui ricavi di vendita di gas a prezzi liberi a mezzo reti canalizzate","euro"]
["100827.000000.002030","Grandezze monetarie per attività DIST GAS",100827,2030,null,"Invariata","DIST GAS","Fatturato","euro","Fatturato","euro","Fatturato","euro"]
["100827.000000.010627","Grandezze monetarie per attività DIST GAS",100827,10627,null,"Invariata","DIST GAS","Clienti attivi - Totale fatturato nell'anno","euro","Clienti attivi - Totale fatturato nell'anno","euro","Clienti attivi - Totale fatturato nell'anno","euro"]
["100827.000000.011095","Grandezze monetarie per attività DIST GAS",100827,11095,null,"Invariata","DIST GAS","Interessi passivi su factoring (come da CE NA)","euro","Interessi passivi su factoring (come da CE NA)","euro","Interessi passivi su factoring (come da CE NA)","euro"]
["100827.011095.011092","Grandezze monetarie per attività DIST GAS",100827,11092,11095,"Invariata","DIST GAS","di cui ammessi alla perequazione specifica del SdD distribuzione","euro","di cui ammessi alla perequazione specifica del SdD distribuzione","euro","di cui ammessi alla perequazione specifica del SdD distribuzione","euro"]
["100827.011095.011091","Grandezze monetarie per attività DIST GAS",100827,11091,11095,"Invariata","DIST GAS","altri interessi passivi su factoring","euro","altri interessi passivi su factoring","euro","altri interessi passivi su factoring","euro"]
["100831.000000.002030","Grandezze monetarie per attività VEN F GAS ST",100831,2030,null,"Eliminata","VEN F GAS ST","Fatturato","euro"]
["100831.002030.002031","Grandezze monetarie per attività VEN F GAS ST",100831,2031,2030,"Eliminata","VEN F GAS ST","Ricavi da vendita ","euro"]
["100831.002030.002032","Grandezze monetarie per attività VEN F GAS ST",100831,2032,2030,"Eliminata","VEN F GAS ST","Altre prestanzioni","euro"]
["100831.002030.002034","Grandezze monetarie per attività VEN F GAS ST",100831,2034,2030,"Eliminata","VEN F GAS ST","IVA e imposte","euro"]
[{"$f":"CONCATENATE(TEXT(C195,\"000000\"),\".\",TEXT(E195,\"000000\"),\".\",TEXT(D195,\"000000\"))","v":"100831.000000.011095"},"Grandezze monetarie per attività VEN F GAS ST",100831,11095,null,{"$f":"IF(AND(H195=J195,I195=K195),\"Invariata\",IF(H195=\"\",\"Aggiunta\",IF(J195=\"\",\"Eliminata\",\"Modificata\")))","v":"Eliminata"},"VEN F GAS ST","Interessi passivi su factoring (come da CE NA)","euro"]
["100831.011095.011088","Grandezze monetarie per attività VEN F GAS ST",100831,11088,11095,"Eliminata","VEN F GAS ST","      di cui ammessi al meccanismo di reintegrazione FUI","euro"]
["100831.011095.011086","Grandezze monetarie per attività VEN F GAS ST",100831,11086,11095,"Eliminata","VEN F GAS ST","      di cui ammessi al meccanismo di copertura dal rischio di mancato pagamento FT trasporto","euro"]
["100831.011095.011085","Grandezze monetarie per attività VEN F GAS ST",100831,11085,11095,"Eliminata","VEN F GAS ST","      altri interessi passivi su factoring non relativi alla vendita di gas naturale ai clienti finali nel servizio di tutela e servizi di ultima istanza","euro"]
["100831.011095.011087","Grandezze monetarie per attività VEN F GAS ST",100831,11087,11095,"Eliminata","VEN F GAS ST","      di cui ammessi al meccanismo di reintegrazione FDD","euro"]
["100831.011095.012118","Grandezze monetarie per attività VEN F GAS ST",100831,12118,11095,"Eliminata","VEN F GAS ST","      di cui ammessi al meccanismo di copertura morosità sisma","euro"]
["100831.000000.001114","Grandezze monetarie per attività VEN F GAS ST",100831,1114,null,"Eliminata","VEN F GAS ST","Clienti tutelati","euro"]
["100831.000000.011573","Grandezze monetarie per attività VEN F GAS ST",100831,11573,null,"Eliminata","VEN F GAS ST","      Vendite a clienti tutelati aventi prezzi regolati","euro"]
["100837.000000.002030","Grandezze monetarie per attività VEN F GAS ML",100837,2030,null,"Invariata","VEN F GAS ML","Fatturato","euro","Fatturato","euro","Fatturato","euro"]
["100837.002030.002031","Grandezze monetarie per attività VEN F GAS ML",100837,2031,2030,"Invariata","VEN F GAS ML","Ricavi da vendita ","euro","Ricavi da vendita ","euro","Ricavi da vendita ","euro"]
["100837.002030.002032","Grandezze monetarie per attività VEN F GAS ML",100837,2032,2030,"Invariata","VEN F GAS ML","Altre prestanzioni","euro","Altre prestanzioni","euro","Altre prestanzioni","euro"]
["100837.002030.002034","Grandezze monetarie per attività VEN F GAS ML",100837,2034,2030,"Invariata","VEN F GAS ML","IVA e imposte","euro","IVA e imposte","euro","IVA e imposte","euro"]
["100837.000000.011574","Grandezze monetarie per attività VEN F GAS ML",100837,11574,null,"Invariata","VEN F GAS ML","      Vendite a condizioni di mercato libero","euro","      Vendite a condizioni di mercato libero","euro","      Vendite a condizioni di mercato libero","euro"]
["100837.000000.001114","Grandezze monetarie per attività VEN F GAS ML",100837,1114,null,"Invariata","VEN F GAS ML","Clienti tutelati","euro","Clienti tutelati","euro","Clienti tutelati","euro"]
["000000.000000.002030","Grandezze monetarie per attività VEND EE CF CDNV",null,2030,null,"Aggiunta","VEND EE CF CDNV",null,null,"Fatturato",null,"Fatturato"]
["000000.002030.002031","Grandezze monetarie per attività VEND EE CF CDNV",null,2031,2030,"Aggiunta","VEND EE CF CDNV",null,null,"Ricavi da vendita ",null,"Ricavi da vendita "]
["000000.002030.002032","Grandezze monetarie per attività VEND EE CF CDNV",null,2032,2030,"Aggiunta","VEND EE CF CDNV",null,null,"Altre prestanzioni",null,"Altre prestanzioni"]
["000000.002030.002033","Grandezze monetarie per attività VEND EE CF CDNV",null,2033,2030,"Aggiunta","VEND EE CF CDNV",null,null,"Componenti A e UC",null,"Componenti A e UC"]
["000000.002030.002034","Grandezze monetarie per attività VEND EE CF CDNV",null,2034,2030,"Aggiunta","VEND EE CF CDNV",null,null,"IVA e imposte",null,"IVA e imposte"]
["000000.000000.011095","Grandezze monetarie per attività VEND EE CF CDNV",null,11095,null,"Aggiunta","VEND EE CF CDNV",null,null,"Interessi passivi su factoring (come da CE NA)",null,"Interessi passivi su factoring (come da CE NA)"]
["000000.011095.012118","Grandezze monetarie per attività VEND EE CF CDNV",null,12118,11095,"Aggiunta","VEND EE CF CDNV",null,null,"      di cui ammessi al meccanismo di copertura morosità sisma",null,"      di cui ammessi al meccanismo di copertura morosità sisma"]
["000000.011095.012119","Grandezze monetarie per attività VEND EE CF CDNV",null,12119,11095,"Aggiunta","VEND EE CF CDNV",null,null,"      di cui non ammessi ai meccanismi di reintegrazione morosità",null,"      di cui non ammessi ai meccanismi di reintegrazione morosità"]
["000000.000000.001046","Grandezze monetarie per attività VEND EE CF CDNV",null,1046,null,"Aggiunta","VEND EE CF CDNV",null,null,"Punti di prelievo relativi a clienti domestici",null,"Punti di prelievo relativi a clienti domestici"]
["000000.000000.001047","Grandezze monetarie per attività VEND EE CF CDNV",null,1047,null,"Aggiunta","VEND EE CF CDNV",null,null,"Punti di prelievo relativi a clienti non domestici - BT altri usi",null,"Punti di prelievo relativi a clienti non domestici - BT altri usi"]
["000000.000000.001048","Grandezze monetarie per attività VEND EE CF CDNV",null,1048,null,"Aggiunta","VEND EE CF CDNV",null,null,"Punti di prelievo relativi a clienti non domestici - BT ILLUMINAZIONE PUBBLICA",null,"Punti di prelievo relativi a clienti non domestici - BT ILLUMINAZIONE PUBBLICA"]
["000000.000000.001049","Grandezze monetarie per attività VEND EE CF CDNV",null,1049,null,"Aggiunta","VEND EE CF CDNV",null,null,"Punti di prelievo relativi a clienti non domestici - MT altri usi",null,"Punti di prelievo relativi a clienti non domestici - MT altri usi"]
["000000.000000.001050","Grandezze monetarie per attività VEND EE CF CDNV",null,1050,null,"Aggiunta","VEND EE CF CDNV",null,null,"Punti di prelievo relativi a clienti non domestici - MT ILLUMINAZIONE PUBBLICA",null,"Punti di prelievo relativi a clienti non domestici - MT ILLUMINAZIONE PUBBLICA"]
["000000.000000.001051","Grandezze monetarie per attività VEND EE CF CDNV",null,1051,null,"Aggiunta","VEND EE CF CDNV",null,null,"Punti di prelievo relativi a clienti non domestici - AT",null,"Punti di prelievo relativi a clienti non domestici - AT"]
["000000.000000.010625","Grandezze monetarie per attività VEND EE CF CDNV",null,10625,null,"Aggiunta","VEND EE CF CDNV",null,null,"Punti di prelievo relativi a clienti non domestici - Altissima Tensione",null,"Punti di prelievo relativi a clienti non domestici - Altissima Tensione"]
["000000.000000.002030","Grandezze monetarie per attività VEN F GAS STV",null,2030,null,"Aggiunta","VEN F GAS STV",null,null,"Fatturato","euro","Fatturato","euro"]
["000000.002030.002031","Grandezze monetarie per attività VEN F GAS STV",null,2031,2030,"Aggiunta","VEN F GAS STV",null,null,"Ricavi da vendita ","euro","Ricavi da vendita ","euro"]
["000000.002030.002032","Grandezze monetarie per attività VEN F GAS STV",null,2032,2030,"Aggiunta","VEN F GAS STV",null,null,"Altre prestanzioni","euro","Altre prestanzioni","euro"]
["000000.002030.002034","Grandezze monetarie per attività VEN F GAS STV",null,2034,2030,"Aggiunta","VEN F GAS STV",null,null,"IVA e imposte","euro","IVA e imposte","euro"]
["000000.000000.011095","Grandezze monetarie per attività VEN F GAS STV",null,11095,null,"Aggiunta","VEN F GAS STV",null,null,"Interessi passivi su factoring (come da CE NA)","euro","Interessi passivi su factoring (come da CE NA)","euro"]
["000000.011095.011088","Grandezze monetarie per attività VEN F GAS STV",null,11088,11095,"Aggiunta","VEN F GAS STV",null,null,"      di cui ammessi al meccanismo di reintegrazione FUI","euro","      di cui ammessi al meccanismo di reintegrazione FUI","euro"]
["000000.011095.011086","Grandezze monetarie per attività VEN F GAS STV",null,11086,11095,"Aggiunta","VEN F GAS STV",null,null,"      di cui ammessi al meccanismo di copertura dal rischio di mancato pagamento FT trasporto","euro","      di cui ammessi al meccanismo di copertura dal rischio di mancato pagamento FT trasporto","euro"]
["000000.011095.011085","Grandezze monetarie per attività VEN F GAS STV",null,11085,11095,"Aggiunta","VEN F GAS STV",null,null,"      altri interessi passivi su factoring non relativi alla vendita di gas naturale ai clienti finali nel servizio di tutela e servizi di ultima istanza","euro","      altri interessi passivi su factoring non relativi alla vendita di gas naturale ai clienti finali nel servizio di tutela e servizi di ultima istanza","euro"]
["000000.011095.011087","Grandezze monetarie per attività VEN F GAS STV",null,11087,11095,"Aggiunta","VEN F GAS STV",null,null,"      di cui ammessi al meccanismo di reintegrazione FDD","euro","      di cui ammessi al meccanismo di reintegrazione FDD","euro"]
["000000.011095.012118","Grandezze monetarie per attività VEN F GAS STV",null,12118,11095,"Aggiunta","VEN F GAS STV",null,null,"      di cui ammessi al meccanismo di copertura morosità sisma","euro","      di cui ammessi al meccanismo di copertura morosità sisma","euro"]
["000000.000000.001109","Grandezze monetarie per attività VEN F GAS STV",null,1109,null,"Aggiunta","VEN F GAS STV",null,null,"Clienti a condizioni di mercato libero","Num. medio annuo","Clienti a condizioni di mercato libero","Num. medio annuo"]
["000000.000000.001114","Grandezze monetarie per attività VEN F GAS STV",null,1114,null,"Aggiunta","VEN F GAS STV",null,null,"Clienti tutelati","euro","Clienti tutelati","euro"]
["000000.000000.011573","Grandezze monetarie per attività VEN F GAS STV",null,11573,null,"Aggiunta","VEN F GAS STV",null,null,"      Vendite a clienti tutelati aventi prezzi regolati","euro","      Vendite a clienti tutelati aventi prezzi regolati","euro"]
["000000.000000.012691","Grandezze monetarie per attività VEN F GAS STV SAC",null,12691,null,"Aggiunta","VEN F GAS STV SAC",null,null,"Costi","euro","Costi","euro"]
["000000.000000.012655","Grandezze monetarie per attività VEN F GAS STV SAC",null,12655,null,"Aggiunta","VEN F GAS STV SAC",null,null,"Riepilogo spese di acquisizione clientela:","euro","Riepilogo spese di acquisizione clientela:","euro"]
["000000.012655.012656","Grandezze monetarie per attività VEN F GAS STV SAC",null,12656,12655,"Aggiunta","VEN F GAS STV SAC",null,null,"di cui costi per servizi da terzi capitalizzati (deve quadrare con la rispettiva voce indicata alla voce 4) del conto economico)","euro","di cui costi per servizi da terzi capitalizzati (deve quadrare con la rispettiva voce indicata alla voce 4) del conto economico)","euro"]
["000000.012655.012657","Grandezze monetarie per attività VEN F GAS STV SAC",null,12657,12655,"Aggiunta","VEN F GAS STV SAC",null,null,"di cui costi per servizi da altre imprese del gruppo capitalizzati (deve quadrare con la rispettiva voce indicata alla voce 4) del conto economico)","euro","di cui costi per servizi da altre imprese del gruppo capitalizzati (deve quadrare con la rispettiva voce indicata alla voce 4) del conto economico)","euro"]
["000000.012655.012658","Grandezze monetarie per attività VEN F GAS STV SAC",null,12658,12655,"Aggiunta","VEN F GAS STV SAC",null,null,"di cui costi per il personale capitalizzati","euro","di cui costi per il personale capitalizzati","euro"]
["000000.012655.012659","Grandezze monetarie per attività VEN F GAS STV SAC",null,12659,12655,"Aggiunta","VEN F GAS STV SAC",null,null,"di cui altri costi capitalizzati","euro","di cui altri costi capitalizzati","euro"]
["000000.012655.012660","Grandezze monetarie per attività VEN F GAS STV SAC",null,12660,12655,"Aggiunta","VEN F GAS STV SAC",null,null,"di cui costi per servizi da terzi non capitalizzati (deve quadrare con la rispettiva voce indicata in conto economico)","euro","di cui costi per servizi da terzi non capitalizzati (deve quadrare con la rispettiva voce indicata in conto economico)","euro"]
["000000.012655.012661","Grandezze monetarie per attività VEN F GAS STV SAC",null,12661,12655,"Aggiunta","VEN F GAS STV SAC",null,null,"di cui costi per servizi da altre imprese del gruppo non capitalizzati (deve quadrare con la rispettiva voce indicata in conto economico)","euro","di cui costi per servizi da altre imprese del gruppo non capitalizzati (deve quadrare con la rispettiva voce indicata in conto economico)","euro"]
["000000.012655.012662","Grandezze monetarie per attività VEN F GAS STV SAC",null,12662,12655,"Aggiunta","VEN F GAS STV SAC",null,null,"di cui costi per il personale non capitalizzati","euro","di cui costi per il personale non capitalizzati","euro"]
["000000.012655.012663","Grandezze monetarie per attività VEN F GAS STV SAC",null,12663,12655,"Aggiunta","VEN F GAS STV SAC",null,null,"di cui altri costi non capitalizzati","euro","di cui altri costi non capitalizzati","euro"]
["000000.012655.012664","Grandezze monetarie per attività VEN F GAS STV SAC",null,12664,12655,"Aggiunta","VEN F GAS STV SAC",null,null,"di cui ammortamento costi di acquisizione clientela (in applicazione dell'ifrs 15)","euro","di cui ammortamento costi di acquisizione clientela (in applicazione dell'ifrs 15)","euro"]
["***.000000.002030",null,"***",2030,null,"Aggiunta","VEND EE CF TG CDNV",null,null,"Fatturato","euro","Fatturato","euro"]
["***.002030.002031",null,"***",2031,2030,"Aggiunta","VEND EE CF TG CDNV",null,null,"Ricavi da vendita ","euro","Ricavi da vendita ","euro"]
["***.002030.002032",null,"***",2032,2030,"Aggiunta","VEND EE CF TG CDNV",null,null,"Altre prestanzioni","euro","Altre prestanzioni","euro"]
["***.002030.002033",null,"***",2033,2030,"Aggiunta","VEND EE CF TG CDNV",null,null,"Componenti A e UC","euro","Componenti A e UC","euro"]
["***.002030.002034",null,"***",2034,2030,"Aggiunta","VEND EE CF TG CDNV",null,null,"IVA e imposte","euro","IVA e imposte","euro"]
["***.000000.011095",null,"***",11095,null,"Aggiunta","VEND EE CF TG CDNV",null,null,"Interessi passivi su factoring (come da CE NA)","euro","Interessi passivi su factoring (come da CE NA)","euro"]
["***.011095.011084",null,"***",11084,11095,"Aggiunta","VEND EE CF TG CDNV",null,null,"      altri interessi passivi su factoring non relativi alla vendita di energia elettrica ai clienti finali in salvaguardia","euro","      altri interessi passivi su factoring non relativi alla vendita di energia elettrica ai clienti finali in salvaguardia","euro"]
["***.011095.011089",null,"***",11089,11095,"Aggiunta","VEND EE CF TG CDNV",null,null,"      di cui ammessi al meccanismo di reintegrazione salvaguardia","euro","      di cui ammessi al meccanismo di reintegrazione salvaguardia","euro"]
["***.011095.012118",null,"***",12118,11095,"Aggiunta","VEND EE CF TG CDNV",null,null,"      di cui ammessi al meccanismo di copertura morosità sisma","euro","      di cui ammessi al meccanismo di copertura morosità sisma","euro"]
["***.011095.012119",null,"***",12119,11095,"Aggiunta","VEND EE CF TG CDNV",null,null,"      di cui non ammessi ai meccanismi di reintegrazione morosità","euro","      di cui non ammessi ai meccanismi di reintegrazione morosità","euro"]
["***.000000.001046",null,"***",1046,null,"Aggiunta","VEND EE CF TG CDNV",null,null,"Punti di prelievo relativi a clienti domestici","euro","Punti di prelievo relativi a clienti domestici","euro"]
[{"$f":"CONCATENATE(TEXT(C259,\"000000\"),\".\",TEXT(E259,\"000000\"),\".\",TEXT(D259,\"000000\"))","v":"***.000000.001047"},null,"***",1047,null,{"$f":"IF(AND(H259=J259,I259=K259),\"Invariata\",IF(H259=\"\",\"Aggiunta\",IF(J259=\"\",\"Eliminata\",\"Modificata\")))","v":"Aggiunta"},"VEND EE CF TG CDNV",null,null,"Punti di prelievo relativi a clienti non domestici - BT altri usi","euro","Punti di prelievo relativi a clienti non domestici - BT altri usi","euro"]
["***.000000.001048",null,"***",1048,null,"Aggiunta","VEND EE CF TG CDNV",null,null,"Punti di prelievo relativi a clienti non domestici - BT ILLUMINAZIONE PUBBLICA","euro","Punti di prelievo relativi a clienti non domestici - BT ILLUMINAZIONE PUBBLICA","euro"]
["***.000000.001049",null,"***",1049,null,"Aggiunta","VEND EE CF TG CDNV",null,null,"Punti di prelievo relativi a clienti non domestici - MT altri usi","euro","Punti di prelievo relativi a clienti non domestici - MT altri usi","euro"]
["***.000000.001050",null,"***",1050,null,"Aggiunta","VEND EE CF TG CDNV",null,null,"Punti di prelievo relativi a clienti non domestici - MT ILLUMINAZIONE PUBBLICA","euro","Punti di prelievo relativi a clienti non domestici - MT ILLUMINAZIONE PUBBLICA","euro"]
["***.000000.001051",null,"***",1051,null,"Aggiunta","VEND EE CF TG CDNV",null,null,"Punti di prelievo relativi a clienti non domestici - AT","euro","Punti di prelievo relativi a clienti non domestici - AT","euro"]
["***.000000.010625",null,"***",10625,null,"Aggiunta","VEND EE CF TG CDNV",null,null,"Punti di prelievo relativi a clienti non domestici - Altissima Tensione","euro","Punti di prelievo relativi a clienti non domestici - Altissima Tensione","euro"]
["***.000000.002030",null,"***",2030,null,"Aggiunta","comparto VEND EE CF TG CDNV",null,null,"Fatturato","euro","Fatturato","euro"]
["***.002030.002031",null,"***",2031,2030,"Aggiunta","comparto VEND EE CF TG CDNV",null,null,"Ricavi da vendita ","euro","Ricavi da vendita ","euro"]
["***.002030.002032",null,"***",2032,2030,"Aggiunta","comparto VEND EE CF TG CDNV",null,null,"Altre prestanzioni","euro","Altre prestanzioni","euro"]
["***.002030.002033",null,"***",2033,2030,"Aggiunta","comparto VEND EE CF TG CDNV",null,null,"Componenti A e UC","euro","Componenti A e UC","euro"]
["***.002030.002034",null,"***",2034,2030,"Aggiunta","comparto VEND EE CF TG CDNV",null,null,"IVA e imposte","euro","IVA e imposte","euro"]
["***.000000.011095",null,"***",11095,null,"Aggiunta","comparto VEND EE CF TG CDNV",null,null,"Interessi passivi su factoring (come da CE NA)","euro","Interessi passivi su factoring (come da CE NA)","euro"]
["***.011095.011084",null,"***",11084,11095,"Aggiunta","comparto VEND EE CF TG CDNV",null,null,"      altri interessi passivi su factoring non relativi alla vendita di energia elettrica ai clienti finali in salvaguardia","euro","      altri interessi passivi su factoring non relativi alla vendita di energia elettrica ai clienti finali in salvaguardia","euro"]
["***.011095.011089",null,"***",11089,11095,"Aggiunta","comparto VEND EE CF TG CDNV",null,null,"      di cui ammessi al meccanismo di reintegrazione salvaguardia","euro","      di cui ammessi al meccanismo di reintegrazione salvaguardia","euro"]
["***.011095.012118",null,"***",12118,11095,"Aggiunta","comparto VEND EE CF TG CDNV",null,null,"      di cui ammessi al meccanismo di copertura morosità sisma","euro","      di cui ammessi al meccanismo di copertura morosità sisma","euro"]
["***.011095.012119",null,"***",12119,11095,"Aggiunta","comparto VEND EE CF TG CDNV",null,null,"      di cui non ammessi ai meccanismi di reintegrazione morosità","euro","      di cui non ammessi ai meccanismi di reintegrazione morosità","euro"]
["***.000000.001046",null,"***",1046,null,"Aggiunta","comparto VEND EE CF TG CDNV",null,null,"Punti di prelievo relativi a clienti domestici","euro","Punti di prelievo relativi a clienti domestici","euro"]
["***.000000.001047",null,"***",1047,null,"Aggiunta","comparto VEND EE CF TG CDNV",null,null,"Punti di prelievo relativi a clienti non domestici - BT altri usi","euro","Punti di prelievo relativi a clienti non domestici - BT altri usi","euro"]
["***.000000.001048",null,"***",1048,null,"Aggiunta","comparto VEND EE CF TG CDNV",null,null,"Punti di prelievo relativi a clienti non domestici - BT ILLUMINAZIONE PUBBLICA","euro","Punti di prelievo relativi a clienti non domestici - BT ILLUMINAZIONE PUBBLICA","euro"]
["***.000000.001049",null,"***",1049,null,"Aggiunta","comparto VEND EE CF TG CDNV",null,null,"Punti di prelievo relativi a clienti non domestici - MT altri usi","euro","Punti di prelievo relativi a clienti non domestici - MT altri usi","euro"]
["***.000000.001050",null,"***",1050,null,"Aggiunta","comparto VEND EE CF TG CDNV",null,null,"Punti di prelievo relativi a clienti non domestici - MT ILLUMINAZIONE PUBBLICA","euro","Punti di prelievo relativi a clienti non domestici - MT ILLUMINAZIONE PUBBLICA","euro"]
["***.000000.001051",null,"***",1051,null,"Aggiunta","comparto VEND EE CF TG CDNV",null,null,"Punti di prelievo relativi a clienti non domestici - AT","euro","Punti di prelievo relativi a clienti non domestici - AT","euro"]
["***.000000.010625",null,"***",10625,null,"Aggiunta","comparto VEND EE CF TG CDNV",null,null,"Punti di prelievo relativi a clienti non domestici - Altissima Tensione","euro","Punti di prelievo relativi a clienti non domestici - Altissima Tensione","euro"]

{"sheet":"Immobilizzazioni","index":4,"n_rows":113,"n_cols":10,"rows_kept":113}
["Indice","Prospetto old","ID prospetto","ID voce","ID voce padre","Modifica","Prospetto","Voce 2024","Voce 2025","Voce 2026"]
[{"$f":"CONCATENATE(TEXT(C2,\"000000\"),\".\",TEXT(E2,\"000000\"),\".\",TEXT(D2,\"000000\"))","v":"000300.000000.004213"},"MOVIMENTAZIONE DELLE IMMOBILIZZAZIONI SEMPLIFICATE",300,4213,null,{"$f":"IF(TRIM(H2)=TRIM(I2),\"Invariata\",IF(H2=\"\",\"Aggiunta\",IF(I2=\"\",\"Eliminata\",\"Modificata\")))","v":"Invariata"},"Tutti","SALDO FINALE","SALDO FINALE","SALDO FINALE"]
["000300.004209.011322","MOVIMENTAZIONE DELLE IMMOBILIZZAZIONI SEMPLIFICATE",300,11322,4209,{"$f":"IF(TRIM(H3)=TRIM(I3),\"Invariata\",IF(H3=\"\",\"Aggiunta\",IF(I3=\"\",\"Eliminata\",\"Modificata\")))","v":"Invariata"},"Tutti","SALDO INIZIALE","SALDO INIZIALE","SALDO INIZIALE"]
["000300.004213.003002","MOVIMENTAZIONE DELLE IMMOBILIZZAZIONI SEMPLIFICATE",300,3002,4213,"Invariata","Tutti","VARIAZIONE NETTA","VARIAZIONE NETTA","VARIAZIONE NETTA"]
["000300.011365.011327","MOVIMENTAZIONE DELLE IMMOBILIZZAZIONI SEMPLIFICATE",300,11327,11365,"Invariata","Tutti","INCREMENTI","INCREMENTI","INCREMENTI"]
["000300.011323.011324","MOVIMENTAZIONE DELLE IMMOBILIZZAZIONI SEMPLIFICATE",300,11324,11323,"Invariata","Tutti","CONTRIBUTI A FONDO PERDUTO C/TO IMPIANTI PORTATI IN DEDUZIONE (PER COMPETENZA)","CONTRIBUTI A FONDO PERDUTO C/TO IMPIANTI PORTATI IN DEDUZIONE (PER COMPETENZA)","CONTRIBUTI A FONDO PERDUTO C/TO IMPIANTI PORTATI IN DEDUZIONE (PER COMPETENZA)"]
["000300.011325.011326","MOVIMENTAZIONE DELLE IMMOBILIZZAZIONI SEMPLIFICATE",300,11326,11325,"Invariata","Tutti","CONTRIBUTI DI ALLACCIAMENTO PORTATI IN DEDUZIONE (PER COMPETENZA)","CONTRIBUTI DI ALLACCIAMENTO PORTATI IN DEDUZIONE (PER COMPETENZA)","CONTRIBUTI DI ALLACCIAMENTO PORTATI IN DEDUZIONE (PER COMPETENZA)"]
["000300.011369.011370","MOVIMENTAZIONE DELLE IMMOBILIZZAZIONI SEMPLIFICATE",300,11370,11369,"Invariata","Tutti","ONERI FINANZIARI CAPITALIZZATI","ONERI FINANZIARI CAPITALIZZATI","ONERI FINANZIARI CAPITALIZZATI"]
["000300.011328.011329","MOVIMENTAZIONE DELLE IMMOBILIZZAZIONI SEMPLIFICATE",300,11329,11328,"Invariata","Tutti","RIVALUTAZIONI (ANCHE PER ALLINEAMENTO A FAIR VALUE IN CASO DI UTILIZZO IAS/IFRS)","RIVALUTAZIONI (ANCHE PER ALLINEAMENTO A FAIR VALUE IN CASO DI UTILIZZO IAS/IFRS)","RIVALUTAZIONI (ANCHE PER ALLINEAMENTO A FAIR VALUE IN CASO DI UTILIZZO IAS/IFRS)"]
["000300.011330.011331","MOVIMENTAZIONE DELLE IMMOBILIZZAZIONI SEMPLIFICATE",300,11331,11330,"Invariata","Tutti","SVALUTAZIONI (ANCHE PER ALLINEAMENTO A FAIR VALUE IN CASO DI UTILIZZO IAS/IFRS)","SVALUTAZIONI (ANCHE PER ALLINEAMENTO A FAIR VALUE IN CASO DI UTILIZZO IAS/IFRS)","SVALUTAZIONI (ANCHE PER ALLINEAMENTO A FAIR VALUE IN CASO DI UTILIZZO IAS/IFRS)"]
["000300.011366.011332","MOVIMENTAZIONE DELLE IMMOBILIZZAZIONI SEMPLIFICATE",300,11332,11366,"Invariata","Tutti","AMMORTAMENTI","AMMORTAMENTI","AMMORTAMENTI"]
["000300.011333.011334","MOVIMENTAZIONE DELLE IMMOBILIZZAZIONI SEMPLIFICATE",300,11334,11333,"Invariata","Tutti","DISMISSIONI (COSTO STORICO BENI DISMESSI)","DISMISSIONI (COSTO STORICO BENI DISMESSI)","DISMISSIONI (COSTO STORICO BENI DISMESSI)"]
["000300.011336.011337","MOVIMENTAZIONE DELLE IMMOBILIZZAZIONI SEMPLIFICATE",300,11337,11336,"Invariata","Tutti","STORNO FONDO AMMORTAMENTO PER DISMISSIONE","STORNO FONDO AMMORTAMENTO PER DISMISSIONE","STORNO FONDO AMMORTAMENTO PER DISMISSIONE"]
["000300.011367.011335","MOVIMENTAZIONE DELLE IMMOBILIZZAZIONI SEMPLIFICATE",300,11335,11367,"Invariata","Tutti","RICLASSIFICHE","RICLASSIFICHE","RICLASSIFICHE"]
["000300.011338.011339","MOVIMENTAZIONE DELLE IMMOBILIZZAZIONI SEMPLIFICATE",300,11339,11338,"Invariata","Tutti","ALTRO (SPECIFICARE IN NOTA DI COMMENTO)","ALTRO (SPECIFICARE IN NOTA DI COMMENTO)","ALTRO (SPECIFICARE IN NOTA DI COMMENTO)"]
[{"$f":"CONCATENATE(TEXT(C16,\"000000\"),\".\",TEXT(E16,\"000000\"),\".\",TEXT(D16,\"000000\"))","v":"100008.000000.000753"},"Movimentazione delle immobilizzazioni per attività PROD EE",100008,753,null,"Invariata","PROD EE","        Immobilizzazioni immateriali","        Immobilizzazioni immateriali","        Immobilizzazioni immateriali"]
["100008.000753.000754","Movimentazione delle immobilizzazioni per attività PROD EE",100008,754,753,"Invariata","PROD EE","        1)     - Costi di impianto e di ampliamento","        1)     - Costi di impianto e di ampliamento","        1)     - Costi di impianto e di ampliamento"]
["100008.000753.011348","Movimentazione delle immobilizzazioni per attività PROD EE",100008,11348,753,"Invariata","PROD EE","        2)     - Costi di sviluppo","        2)     - Costi di sviluppo","        2)     - Costi di sviluppo"]
["100008.000753.000756","Movimentazione delle immobilizzazioni per attività PROD EE",100008,756,753,"Invariata","PROD EE","        3)     - Diritti di brevetto industriale e diritti di utilizzazione delle opere dell'ingegno","        3)     - Diritti di brevetto industriale e diritti di utilizzazione delle opere dell'ingegno","        3)     - Diritti di brevetto industriale e diritti di utilizzazione delle opere dell'ingegno"]
["100008.000753.000757","Movimentazione delle immobilizzazioni per attività PROD EE",100008,757,753,"Invariata","PROD EE","        4)     - Concessioni, licenze, marchi e diritti simili","        4)     - Concessioni, licenze, marchi e diritti simili","        4)     - Concessioni, licenze, marchi e diritti simili"]
["100008.000753.000758","Movimentazione delle immobilizzazioni per attività PROD EE",100008,758,753,"Invariata","PROD EE","        5)     - Avviamento","        5)     - Avviamento","        5)     - Avviamento"]
["100008.000753.000759","Movimentazione delle immobilizzazioni per attività PROD EE",100008,759,753,"Invariata","PROD EE","        6)     - Immobilizzazioni in corso e acconti","        6)     - Immobilizzazioni in corso e acconti","        6)     - Immobilizzazioni in corso e acconti"]
["100008.000753.000760","Movimentazione delle immobilizzazioni per attività PROD EE",100008,760,753,"Invariata","PROD EE","        7)     - Altre","        7)     - Altre","        7)     - Altre"]
["100008.000000.000762","Movimentazione delle immobilizzazioni per attività PROD EE",100008,762,null,"Invariata","PROD EE","        Immobilizzazioni materiali","        Immobilizzazioni materiali","        Immobilizzazioni materiali"]
["100008.000762.000763","Movimentazione delle immobilizzazioni per attività PROD EE",100008,763,762,"Invariata","PROD EE","        1) Terreni e fabbricati","        1) Terreni e fabbricati","        1) Terreni e fabbricati"]
["100008.000762.000775","Movimentazione delle immobilizzazioni per attività PROD EE",100008,775,762,"Invariata","PROD EE","        2) Impianti e macchinari","        2) Impianti e macchinari","        2) Impianti e macchinari"]
["100008.000762.000916","Movimentazione delle immobilizzazioni per attività PROD EE",100008,916,762,"Invariata","PROD EE","        3) Attrezzature industriali e commerciali","        3) Attrezzature industriali e commerciali","        3) Attrezzature industriali e commerciali"]
["100008.000762.000920","Movimentazione delle immobilizzazioni per attività PROD EE",100008,920,762,"Invariata","PROD EE","        4) Altri beni","        4) Altri beni","        4) Altri beni"]
["100008.000762.000935","Movimentazione delle immobilizzazioni per attività PROD EE",100008,935,762,"Invariata","PROD EE","        5) Immobilizzazioni in corso e acconti","        5) Immobilizzazioni in corso e acconti","        5) Immobilizzazioni in corso e acconti"]
[{"$f":"CONCATENATE(TEXT(C30,\"000000\"),\".\",TEXT(E30,\"000000\"),\".\",TEXT(D30,\"000000\"))","v":"000305.000000.000753"},"Movimentazione delle immobilizzazioni per attività DIST EE",305,753,null,"Invariata","DIST EE","        Immobilizzazioni immateriali","        Immobilizzazioni immateriali","        Immobilizzazioni immateriali"]
["000305.000753.000754","Movimentazione delle immobilizzazioni per attività DIST EE",305,754,753,"Invariata","DIST EE","        1)     - Costi di impianto e di ampliamento","        1)     - Costi di impianto e di ampliamento","        1)     - Costi di impianto e di ampliamento"]
["000305.000753.011348","Movimentazione delle immobilizzazioni per attività DIST EE",305,11348,753,"Invariata","DIST EE","        2)     - Costi di sviluppo","        2)     - Costi di sviluppo","        2)     - Costi di sviluppo"]
["000305.000753.000756","Movimentazione delle immobilizzazioni per attività DIST EE",305,756,753,"Invariata","DIST EE","        3)     - Diritti di brevetto industriale e diritti di utilizzazione delle opere dell'ingegno","        3)     - Diritti di brevetto industriale e diritti di utilizzazione delle opere dell'ingegno","        3)     - Diritti di brevetto industriale e diritti di utilizzazione delle opere dell'ingegno"]
["000305.000753.000757","Movimentazione delle immobilizzazioni per attività DIST EE",305,757,753,"Invariata","DIST EE","        4)     - Concessioni, licenze, marchi e diritti simili","        4)     - Concessioni, licenze, marchi e diritti simili","        4)     - Concessioni, licenze, marchi e diritti simili"]
["000305.000753.000758","Movimentazione delle immobilizzazioni per attività DIST EE",305,758,753,"Invariata","DIST EE","        5)     - Avviamento","        5)     - Avviamento","        5)     - Avviamento"]
["000305.000753.000759","Movimentazione delle immobilizzazioni per attività DIST EE",305,759,753,"Invariata","DIST EE","        6)     - Immobilizzazioni in corso e acconti","        6)     - Immobilizzazioni in corso e acconti","        6)     - Immobilizzazioni in corso e acconti"]
["000305.000753.000760","Movimentazione delle immobilizzazioni per attività DIST EE",305,760,753,"Invariata","DIST EE","        7)     - Altre","        7)     - Altre","        7)     - Altre"]
["000305.000000.000762","Movimentazione delle immobilizzazioni per attività DIST EE",305,762,null,"Invariata","DIST EE","        Immobilizzazioni materiali","        Immobilizzazioni materiali","        Immobilizzazioni materiali"]
["000305.000762.000763","Movimentazione delle immobilizzazioni per attività DIST EE",305,763,762,"Invariata","DIST EE","        1) Terreni e fabbricati","        1) Terreni e fabbricati","        1) Terreni e fabbricati"]
["000305.000762.000775","Movimentazione delle immobilizzazioni per attività DIST EE",305,775,762,"Invariata","DIST EE","        2) Impianti e macchinari","        2) Impianti e macchinari","        2) Impianti e macchinari"]
["000305.000762.000916","Movimentazione delle immobilizzazioni per attività DIST EE",305,916,762,"Invariata","DIST EE","        3) Attrezzature industriali e commerciali","        3) Attrezzature industriali e commerciali","        3) Attrezzature industriali e commerciali"]
["000305.000762.000920","Movimentazione delle immobilizzazioni per attività DIST EE",305,920,762,"Invariata","DIST EE","        4) Altri beni","        4) Altri beni","        4) Altri beni"]
["000305.000762.000935","Movimentazione delle immobilizzazioni per attività DIST EE",305,935,762,"Invariata","DIST EE","        5) Immobilizzazioni in corso e acconti","        5) Immobilizzazioni in corso e acconti","        5) Immobilizzazioni in corso e acconti"]
[{"$f":"CONCATENATE(TEXT(C44,\"000000\"),\".\",TEXT(E44,\"000000\"),\".\",TEXT(D44,\"000000\"))","v":"000306.000000.000753"},"Movimentazione delle immobilizzazioni per attività MIS EE",306,753,null,"Invariata","MIS EE","        Immobilizzazioni immateriali","        Immobilizzazioni immateriali","        Immobilizzazioni immateriali"]
[{"$f":"CONCATENATE(TEXT(C45,\"000000\"),\".\",TEXT(E45,\"000000\"),\".\",TEXT(D45,\"000000\"))","v":"000306.000753.000754"},"Movimentazione delle immobilizzazioni per attività MIS EE",306,754,753,"Invariata","MIS EE","        1)     - Costi di impianto e di ampliamento","        1)     - Costi di impianto e di ampliamento","        1)     - Costi di impianto e di ampliamento"]
["000306.000753.011348","Movimentazione delle immobilizzazioni per attività MIS EE",306,11348,753,"Invariata","MIS EE","        2)     - Costi di sviluppo","        2)     - Costi di sviluppo","        2)     - Costi di sviluppo"]
["000306.000753.000756","Movimentazione delle immobilizzazioni per attività MIS EE",306,756,753,"Invariata","MIS EE","        3)     - Diritti di brevetto industriale e diritti di utilizzazione delle opere dell'ingegno","        3)     - Diritti di brevetto industriale e diritti di utilizzazione delle opere dell'ingegno","        3)     - Diritti di brevetto industriale e diritti di utilizzazione delle opere dell'ingegno"]
["000306.000753.000757","Movimentazione delle immobilizzazioni per attività MIS EE",306,757,753,"Invariata","MIS EE","        4)     - Concessioni, licenze, marchi e diritti simili","        4)     - Concessioni, licenze, marchi e diritti simili","        4)     - Concessioni, licenze, marchi e diritti simili"]
["000306.000753.000758","Movimentazione delle immobilizzazioni per attività MIS EE",306,758,753,"Invariata","MIS EE","        5)     - Avviamento","        5)     - Avviamento","        5)     - Avviamento"]
["000306.000753.000759","Movimentazione delle immobilizzazioni per attività MIS EE",306,759,753,"Invariata","MIS EE","        6)     - Immobilizzazioni in corso e acconti","        6)     - Immobilizzazioni in corso e acconti","        6)     - Immobilizzazioni in corso e acconti"]
["000306.000753.000760","Movimentazione delle immobilizzazioni per attività MIS EE",306,760,753,"Invariata","MIS EE","        7)     - Altre","        7)     - Altre","        7)     - Altre"]
["000306.000000.000762","Movimentazione delle immobilizzazioni per attività MIS EE",306,762,null,"Invariata","MIS EE","        Immobilizzazioni materiali","        Immobilizzazioni materiali","        Immobilizzazioni materiali"]
["000306.000762.000763","Movimentazione delle immobilizzazioni per attività MIS EE",306,763,762,"Invariata","MIS EE","        1) Terreni e fabbricati","        1) Terreni e fabbricati","        1) Terreni e fabbricati"]
["000306.000762.000775","Movimentazione delle immobilizzazioni per attività MIS EE",306,775,762,"Invariata","MIS EE","        2) Impianti e macchinari","        2) Impianti e macchinari","        2) Impianti e macchinari"]
["000306.000762.000916","Movimentazione delle immobilizzazioni per attività MIS EE",306,916,762,"Invariata","MIS EE","        3) Attrezzature industriali e commerciali","        3) Attrezzature industriali e commerciali","        3) Attrezzature industriali e commerciali"]
["000306.000762.000920","Movimentazione delle immobilizzazioni per attività MIS EE",306,920,762,"Invariata","MIS EE","        4) Altri beni","        4) Altri beni","        4) Altri beni"]
["000306.000762.000935","Movimentazione delle immobilizzazioni per attività MIS EE",306,935,762,"Invariata","MIS EE","        5) Immobilizzazioni in corso e acconti","        5) Immobilizzazioni in corso e acconti","        5) Immobilizzazioni in corso e acconti"]
[{"$f":"CONCATENATE(TEXT(C58,\"000000\"),\".\",TEXT(E58,\"000000\"),\".\",TEXT(D58,\"000000\"))","v":"000312.000000.000753"},"Movimentazione delle immobilizzazioni per attività DIST GAS",312,753,null,"Invariata","DIST GAS","        Immobilizzazioni immateriali","        Immobilizzazioni immateriali","        Immobilizzazioni immateriali"]
["000312.000753.000754","Movimentazione delle immobilizzazioni per attività DIST GAS",312,754,753,"Invariata","DIST GAS","        1)     - Costi di impianto e di ampliamento","        1)     - Costi di impianto e di ampliamento","        1)     - Costi di impianto e di ampliamento"]
["000312.000753.011348","Movimentazione delle immobilizzazioni per attività DIST GAS",312,11348,753,"Invariata","DIST GAS","        2)     - Costi di sviluppo","        2)     - Costi di sviluppo","        2)     - Costi di sviluppo"]
["000312.000753.000756","Movimentazione delle immobilizzazioni per attività DIST GAS",312,756,753,"Invariata","DIST GAS","        3)     - Diritti di brevetto industriale e diritti di utilizzazione delle opere dell'ingegno","        3)     - Diritti di brevetto industriale e diritti di utilizzazione delle opere dell'ingegno","        3)     - Diritti di brevetto industriale e diritti di utilizzazione delle opere dell'ingegno"]
["000312.000753.000757","Movimentazione delle immobilizzazioni per attività DIST GAS",312,757,753,"Invariata","DIST GAS","        4)     - Concessioni, licenze, marchi e diritti simili","        4)     - Concessioni, licenze, marchi e diritti simili","        4)     - Concessioni, licenze, marchi e diritti simili"]
["000312.000753.000758","Movimentazione delle immobilizzazioni per attività DIST GAS",312,758,753,"Invariata","DIST GAS","        5)     - Avviamento","        5)     - Avviamento","        5)     - Avviamento"]
["000312.000753.000759","Movimentazione delle immobilizzazioni per attività DIST GAS",312,759,753,"Invariata","DIST GAS","        6)     - Immobilizzazioni in corso e acconti","        6)     - Immobilizzazioni in corso e acconti","        6)     - Immobilizzazioni in corso e acconti"]
["000312.000753.000760","Movimentazione delle immobilizzazioni per attività DIST GAS",312,760,753,"Invariata","DIST GAS","        7)     - Altre","        7)     - Altre","        7)     - Altre"]
["000312.000000.000762","Movimentazione delle immobilizzazioni per attività DIST GAS",312,762,null,"Invariata","DIST GAS","        Immobilizzazioni materiali","        Immobilizzazioni materiali","        Immobilizzazioni materiali"]
["000312.000762.000763","Movimentazione delle immobilizzazioni per attività DIST GAS",312,763,762,{"$f":"IF(TRIM(H67)=TRIM(I67),\"Invariata\",IF(H67=\"\",\"Aggiunta\",IF(I67=\"\",\"Eliminata\",\"Modificata\")))","v":"Invariata"},"DIST GAS","        1) Terreni e fabbricati","        1) Terreni e fabbricati","        1) Terreni e fabbricati"]
["000312.000762.000775","Movimentazione delle immobilizzazioni per attività DIST GAS",312,775,762,"Invariata","DIST GAS","        2) Impianti e macchinari","        2) Impianti e macchinari","        2) Impianti e macchinari"]
["000312.000762.000916","Movimentazione delle immobilizzazioni per attività DIST GAS",312,916,762,"Invariata","DIST GAS","        3) Attrezzature industriali e commerciali","        3) Attrezzature industriali e commerciali","        3) Attrezzature industriali e commerciali"]
["000312.000762.000920","Movimentazione delle immobilizzazioni per attività DIST GAS",312,920,762,"Invariata","DIST GAS","        4) Altri beni","        4) Altri beni","        4) Altri beni"]
["000312.000762.000935","Movimentazione delle immobilizzazioni per attività DIST GAS",312,935,762,"Invariata","DIST GAS","        5) Immobilizzazioni in corso e acconti","        5) Immobilizzazioni in corso e acconti","        5) Immobilizzazioni in corso e acconti"]
[{"$f":"CONCATENATE(TEXT(C72,\"000000\"),\".\",TEXT(E72,\"000000\"),\".\",TEXT(D72,\"000000\"))","v":"000313.000000.000753"},"Movimentazione delle immobilizzazioni per attività MIS GAS",313,753,null,"Invariata","MIS GAS","        Immobilizzazioni immateriali","        Immobilizzazioni immateriali","        Immobilizzazioni immateriali"]
["000313.000753.000754","Movimentazione delle immobilizzazioni per attività MIS GAS",313,754,753,"Invariata","MIS GAS","        1)     - Costi di impianto e di ampliamento","        1)     - Costi di impianto e di ampliamento","        1)     - Costi di impianto e di ampliamento"]
["000313.000753.011348","Movimentazione delle immobilizzazioni per attività MIS GAS",313,11348,753,"Invariata","MIS GAS","        2)     - Costi di sviluppo","        2)     - Costi di sviluppo","        2)     - Costi di sviluppo"]
["000313.000753.000756","Movimentazione delle immobilizzazioni per attività MIS GAS",313,756,753,"Invariata","MIS GAS","        3)     - Diritti di brevetto industriale e diritti di utilizzazione delle opere dell'ingegno","        3)     - Diritti di brevetto industriale e diritti di utilizzazione delle opere dell'ingegno","        3)     - Diritti di brevetto industriale e diritti di utilizzazione delle opere dell'ingegno"]
["000313.000753.000757","Movimentazione delle immobilizzazioni per attività MIS GAS",313,757,753,"Invariata","MIS GAS","        4)     - Concessioni, licenze, marchi e diritti simili","        4)     - Concessioni, licenze, marchi e diritti simili","        4)     - Concessioni, licenze, marchi e diritti simili"]
["000313.000753.000758","Movimentazione delle immobilizzazioni per attività MIS GAS",313,758,753,"Invariata","MIS GAS","        5)     - Avviamento","        5)     - Avviamento","        5)     - Avviamento"]
["000313.000753.000759","Movimentazione delle immobilizzazioni per attività MIS GAS",313,759,753,"Invariata","MIS GAS","        6)     - Immobilizzazioni in corso e acconti","        6)     - Immobilizzazioni in corso e acconti","        6)     - Immobilizzazioni in corso e acconti"]
["000313.000753.000760","Movimentazione delle immobilizzazioni per attività MIS GAS",313,760,753,"Invariata","MIS GAS","        7)     - Altre","        7)     - Altre","        7)     - Altre"]
["000313.000000.000762","Movimentazione delle immobilizzazioni per attività MIS GAS",313,762,null,"Invariata","MIS GAS","        Immobilizzazioni materiali","        Immobilizzazioni materiali","        Immobilizzazioni materiali"]
["000313.000762.000763","Movimentazione delle immobilizzazioni per attività MIS GAS",313,763,762,"Invariata","MIS GAS","        1) Terreni e fabbricati","        1) Terreni e fabbricati","        1) Terreni e fabbricati"]
["000313.000762.000775","Movimentazione delle immobilizzazioni per attività MIS GAS",313,775,762,"Invariata","MIS GAS","        2) Impianti e macchinari","        2) Impianti e macchinari","        2) Impianti e macchinari"]
["000313.000762.000916","Movimentazione delle immobilizzazioni per attività MIS GAS",313,916,762,"Invariata","MIS GAS","        3) Attrezzature industriali e commerciali","        3) Attrezzature industriali e commerciali","        3) Attrezzature industriali e commerciali"]
["000313.000762.000920","Movimentazione delle immobilizzazioni per attività MIS GAS",313,920,762,"Invariata","MIS GAS","        4) Altri beni","        4) Altri beni","        4) Altri beni"]
["000313.000762.000935","Movimentazione delle immobilizzazioni per attività MIS GAS",313,935,762,"Invariata","MIS GAS","        5) Immobilizzazioni in corso e acconti","        5) Immobilizzazioni in corso e acconti","        5) Immobilizzazioni in corso e acconti"]
[{"$f":"CONCATENATE(TEXT(C86,\"000000\"),\".\",TEXT(E86,\"000000\"),\".\",TEXT(D86,\"000000\"))","v":"000316.000000.000753"},"Movimentazione delle immobilizzazioni per FOC",316,753,null,"Invariata","FOC","        Immobilizzazioni immateriali","        Immobilizzazioni immateriali","        Immobilizzazioni immateriali"]
["000316.000753.000754","Movimentazione delle immobilizzazioni per FOC",316,754,753,"Invariata","FOC","        1)     - Costi di impianto e di ampliamento","        1)     - Costi di impianto e di ampliamento","        1)     - Costi di impianto e di ampliamento"]
["000316.000753.011348","Movimentazione delle immobilizzazioni per FOC",316,11348,753,"Invariata","FOC","        2)     - Costi di sviluppo","        2)     - Costi di sviluppo","        2)     - Costi di sviluppo"]
["000316.000753.000756","Movimentazione delle immobilizzazioni per FOC",316,756,753,"Invariata","FOC","        3)     - Diritti di brevetto industriale e diritti di utilizzazione delle opere dell'ingegno","        3)     - Diritti di brevetto industriale e diritti di utilizzazione delle opere dell'ingegno","        3)     - Diritti di brevetto industriale e diritti di utilizzazione delle opere dell'ingegno"]
["000316.000753.000757","Movimentazione delle immobilizzazioni per FOC",316,757,753,"Invariata","FOC","        4)     - Concessioni, licenze, marchi e diritti simili","        4)     - Concessioni, licenze, marchi e diritti simili","        4)     - Concessioni, licenze, marchi e diritti simili"]
["000316.000753.000758","Movimentazione delle immobilizzazioni per FOC",316,758,753,"Invariata","FOC","        5)     - Avviamento","        5)     - Avviamento","        5)     - Avviamento"]
["000316.000753.000759","Movimentazione delle immobilizzazioni per FOC",316,759,753,"Invariata","FOC","        6)     - Immobilizzazioni in corso e acconti","        6)     - Immobilizzazioni in corso e acconti","        6)     - Immobilizzazioni in corso e acconti"]
["000316.000753.000760","Movimentazione delle immobilizzazioni per FOC",316,760,753,"Invariata","FOC","        7)     - Altre","        7)     - Altre","        7)     - Altre"]
["000316.000000.000762","Movimentazione delle immobilizzazioni per FOC",316,762,null,"Invariata","FOC","        Immobilizzazioni materiali","        Immobilizzazioni materiali","        Immobilizzazioni materiali"]
["000316.000762.000763","Movimentazione delle immobilizzazioni per FOC",316,763,762,"Invariata","FOC","        1) Terreni e fabbricati","        1) Terreni e fabbricati","        1) Terreni e fabbricati"]
["000316.000762.000775","Movimentazione delle immobilizzazioni per FOC",316,775,762,"Invariata","FOC","        2) Impianti e macchinari","        2) Impianti e macchinari","        2) Impianti e macchinari"]
["000316.000762.000916","Movimentazione delle immobilizzazioni per FOC",316,916,762,"Invariata","FOC","        3) Attrezzature industriali e commerciali","        3) Attrezzature industriali e commerciali","        3) Attrezzature industriali e commerciali"]
["000316.000762.000920","Movimentazione delle immobilizzazioni per FOC",316,920,762,"Invariata","FOC","        4) Altri beni","        4) Altri beni","        4) Altri beni"]
["000316.000762.000935","Movimentazione delle immobilizzazioni per FOC",316,935,762,"Invariata","FOC","        5) Immobilizzazioni in corso e acconti","        5) Immobilizzazioni in corso e acconti","        5) Immobilizzazioni in corso e acconti"]
[{"$f":"CONCATENATE(TEXT(C100,\"000000\"),\".\",TEXT(E100,\"000000\"),\".\",TEXT(D100,\"000000\"))","v":"000322.000000.000753"},"Movimentazione delle immobilizzazioni SC",322,753,null,"Invariata","SC","        Immobilizzazioni immateriali","        Immobilizzazioni immateriali","        Immobilizzazioni immateriali"]
[{"$f":"CONCATENATE(TEXT(C101,\"000000\"),\".\",TEXT(E101,\"000000\"),\".\",TEXT(D101,\"000000\"))","v":"000322.000753.000754"},"Movimentazione delle immobilizzazioni SC",322,754,753,"Invariata","SC","        1)     - Costi di impianto e di ampliamento","        1)     - Costi di impianto e di ampliamento","        1)     - Costi di impianto e di ampliamento"]
["000322.000753.011348","Movimentazione delle immobilizzazioni SC",322,11348,753,"Invariata","SC","        2)     - Costi di sviluppo","        2)     - Costi di sviluppo","        2)     - Costi di sviluppo"]
["000322.000753.000756","Movimentazione delle immobilizzazioni SC",322,756,753,"Invariata","SC","        3)     - Diritti di brevetto industriale e diritti di utilizzazione delle opere dell'ingegno","        3)     - Diritti di brevetto industriale e diritti di utilizzazione delle opere dell'ingegno","        3)     - Diritti di brevetto industriale e diritti di utilizzazione delle opere dell'ingegno"]
["000322.000753.000757","Movimentazione delle immobilizzazioni SC",322,757,753,"Invariata","SC","        4)     - Concessioni, licenze, marchi e diritti simili","        4)     - Concessioni, licenze, marchi e diritti simili","        4)     - Concessioni, licenze, marchi e diritti simili"]
["000322.000753.000758","Movimentazione delle immobilizzazioni SC",322,758,753,"Invariata","SC","        5)     - Avviamento","        5)     - Avviamento","        5)     - Avviamento"]
["000322.000753.000759","Movimentazione delle immobilizzazioni SC",322,759,753,"Invariata","SC","        6)     - Immobilizzazioni in corso e acconti","        6)     - Immobilizzazioni in corso e acconti","        6)     - Immobilizzazioni in corso e acconti"]
["000322.000753.000760","Movimentazione delle immobilizzazioni SC",322,760,753,"Invariata","SC","        7)     - Altre","        7)     - Altre","        7)     - Altre"]
["000322.000000.000762","Movimentazione delle immobilizzazioni SC",322,762,null,"Invariata","SC","        Immobilizzazioni materiali","        Immobilizzazioni materiali","        Immobilizzazioni materiali"]
["000322.000762.000763","Movimentazione delle immobilizzazioni SC",322,763,762,"Invariata","SC","        1) Terreni e fabbricati","        1) Terreni e fabbricati","        1) Terreni e fabbricati"]
["000322.000762.000775","Movimentazione delle immobilizzazioni SC",322,775,762,"Invariata","SC","        2) Impianti e macchinari","        2) Impianti e macchinari","        2) Impianti e macchinari"]
["000322.000762.000916","Movimentazione delle immobilizzazioni SC",322,916,762,"Invariata","SC","        3) Attrezzature industriali e commerciali","        3) Attrezzature industriali e commerciali","        3) Attrezzature industriali e commerciali"]
["000322.000762.000920","Movimentazione delle immobilizzazioni SC",322,920,762,"Invariata","SC","        4) Altri beni","        4) Altri beni","        4) Altri beni"]
["000322.000762.000935","Movimentazione delle immobilizzazioni SC",322,935,762,"Invariata","SC","        5) Immobilizzazioni in corso e acconti","        5) Immobilizzazioni in corso e acconti","        5) Immobilizzazioni in corso e acconti"]