{"text_format":"3","workbook":"xlsx","n_sheets":8,"sheets":["Menu","QT-Acquedotto","QT-Fognatura","QT-Depurazione","QT-Altri dati","QT-Resilienza","Riepilogo RQTI","TT_Gestori-ATO"],"not_rendered":{"images":2,"defined_names":14,"comments":2},"read":"whole","date_system":"1900"}

{"sheet":"Menu","index":0,"n_rows":15,"n_cols":6,"rows_kept":15,"merged":[[0,1,0,5],[9,1,14,1],[9,2,9,5],[10,2,10,5],[11,2,11,5],[12,2,12,5],[13,2,13,5],[14,2,14,5]]}
[null,"RQTI 2026 - Raccolta dati di consuntivo di qualità tecnica - Anno 2025"]
[null,"ATO",null,null,"GESTORE"]
[null,"ID_ATO","ATO","campo_vuoto","ID_ARERA_Gestore","Gestore"]
[null,null,{"$f":"IF(B4=\"\",\"\",VLOOKUP(B4,'TT_Gestori-ATO'!$B:$C,2,FALSE))","v":""},null,null,{"$f":"IF(E4=\"\",\"\",VLOOKUP(E4,'TT_Gestori-ATO'!$F:$G,2,FALSE))","v":""}]
[]
[{"$nulls":4},"gg/mm/aa"]
[null,null,"data di chiusura della Raccolta dati RQTI_2026 ",null,"2026-06-30","ai sensi del comma 1.2 della deliberazione 581/2025/R/idr - NON cancellare né sovrascrivere"]
[]
[null,null,"Elenco schede (cliccare sul titolo per andare alla scheda corrispondente):"]
[null,"Monitoraggio RQTI per applicazione meccanismo incentivante per il biennio 2024-2025","Qualità Tecnica: Acquedotto (dati 2025)"]
[null,null,"Qualità Tecnica: Fognatura (dati 2025)"]
[null,null,"Qualità Tecnica: Depurazione (dati 2025)"]
[null,null,"Altri dati per monitoraggio RQTI (dati 2025)"]
[null,null,"Qualità Tecnica: QT-Resilienza (dati 2025)"]
[null,null,"Riepilogo RQTI: valutazione performance anni 2024-2025 "]
{"$rows_left_out":1}
{"sheet":"QT-Acquedotto","index":1,"n_rows":159,"n_cols":12,"rows_kept":159,"merged":[[28,7,29,7],[28,8,29,8],[34,7,37,7],[34,8,37,8],[42,7,43,7],[42,8,43,8],[56,7,57,7],[56,8,57,8],[67,7,68,7],[67,8,68,8],[69,7,70,7],[69,8,70,8],[80,7,81,7],[80,8,81,8],[84,7,85,7],[84,8,85,8],[104,7,105,7],[104,8,105,8],[134,7,135,7],[134,8,135,8],[139,7,142,7],[139,8,142,8]]}
[null,"Dati per l'applicazione dei meccanismi di \nincentivazione RQTI (premi e penalità)\nTutti i valori imputati sono intesi essere valori \nconsuntivi ",{"$nulls":9},"Errori compilazione colonna \"Valore Anno 2025\""]
["Notazione dato ","Descrizione dato","UdM",null,"Valore Anno 2025","Note compilazione",null,null,"Errore rilevato in colonna \"Valore Anno 2025\"",null,null,{"$f":"SUM(L3:L150)","v":0}]
["ACQ","Il gestore gestisce il servizio di acquedotto?\nSe sì, specificare:","-",null,null,"Al fine del calcolo dei macro-indicatori è necessario indicare se il servizio è gestito",{"$nulls":5},{"$f":"IF(I3=\"\",0,1)","v":0}]
["ACQ_c","- captazione","-",{"$nulls":8},0]
["ACQ_a","- adduzione","-",{"$nulls":8},0]
["ACQ_p","-  potabilizzazione","-",{"$nulls":8},0]
["ACQ_d","- distribuzione","-",null,null,"Al fine del calcolo dei macro-indicatori è necessario indicare se il servizio è gestito",{"$nulls":5},0]
["PRA","Popolazione residente servita (PRA)","ab.",{"$nulls":5},{"$f":"IF(E$7=\"X\",IF(E8<=0,\"Il valore deve essere maggiore di zero\",\"\"),IF(E8<>0,\"Non risulta gestita la distribuzione\",\"\"))","v":""},null,null,0]
["PFA","Popolazione fluttuante (PFA)","ab.",{"$nulls":5},{"$f":"IF(E9<0,\"Il valore deve essere maggiore o uguale a zero\",\"\")","v":""},null,null,0]
["ComA","Numero di comuni serviti (ComA)","n. ",{"$nulls":5},{"$f":"IF(E$7=\"X\",IF(E10<=0,\"Il valore deve essere maggiore di zero\",\"\"),IF(E10<>0,\"Non risulta gestita la distribuzione\",\"\"))","v":""},null,null,0]
["SUA","Superficie  (SUA)","kmq",{"$nulls":5},{"$f":"IF(E$7=\"X\",IF(E11<=0,\"Il valore deve essere maggiore di zero\",\"\"),IF(E11<>0,\"Non risulta gestita la distribuzione\",\"\"))","v":""},null,null,0]
["EEACQ","Consumo di energia elettrica per servizio di acquedotto, al netto dell'energia autoprodotta","kWh",null,null,"Il dato include la quota parte relativa ai servizi comuni",null,null,{"$f":"IF(E12<0,\"Il valore deve essere maggiore o uguale a zero\",\"\")","v":""},null,null,0]
["EEAAI","Consumo di energia elettrica per Altre Attività Idriche (definizione rilevante ai sensi dell'unbundling)","kWh",null,null,"A parità di perimetro la somma dei dati relativi ad Acquedotto, Fognatura, Depurazione ed Altre Attività Idriche (come definite dal TIUC) deve essere coerente con la corrispondente grandezza richiesta a fini tariffari",null,null,{"$f":"IF(E13<0,\"Il valore deve essere maggiore o uguale a zero\",\"\")","v":""},null,null,0]
[{"$nulls":11},0]
["Valutazione prerequisiti e indicazione istanze presentate per M1",{"$nulls":10},0]
{"$rows_left_out":145}
{"sheet":"QT-Fognatura","index":2,"n_rows":56,"n_cols":12,"rows_kept":56}
[null,"Dati per l'applicazione dei meccanismi di \nincentivazione RQTI (premi e penalità)\nTutti i valori imputati sono intesi essere valori \nconsuntivi ",{"$nulls":9},"Errori compilazione colonna \"Valore Anno 2025\""]
["Notazione dato ","Descrizione dato","UdM",null,"Valore Anno 2025","Note compilazione",null,null,"Errore rilevato in colonna \"Valore Anno 2025\"",null,null,{"$f":"SUM(L3:L48)","v":0}]
["FOG","Il gestore gestisce il servizio di fognatura?\nSe sì, specificare:","-",null,null,"Al fine del calcolo dei macro-indicatori è necessario indicare se il servizio è gestito",{"$nulls":5},{"$f":"IF(I3=\"\",0,1)","v":0}]
["FOG_m","- fognatura mista","-",{"$nulls":8},0]
["FOG_n","- fognatura nera","-",{"$nulls":8},0]
["FOG_b","- fognatura bianca","-",null,null,"Se soggetta a regolazione tariffaria",{"$nulls":5},0]
["PRF","Popolazione residente servita (PRF)","ab.",{"$nulls":5},{"$f":"IF(E$3=\"SI\",IF(E7<=0,\"Il valore deve essere maggiore di zero\",\"\"),IF(E7<>0,\"Non risulta gestito il servizio di fognatura\",\"\"))","v":""},null,null,0]
["PFF","Popolazione fluttuante (PFF)","ab.",{"$nulls":5},{"$f":"IF(E8<0,\"Il valore deve essere maggiore o uguale a zero\",\"\")","v":""},null,null,0]
["ComF","Numero di comuni serviti (ComF)","n. ",{"$nulls":5},{"$f":"IF(E$3=\"SI\",IF(E9<=0,\"Il valore deve essere maggiore di zero\",\"\"),IF(E9<>0,\"Non risulta gestito il servizio di fognatura\",\"\"))","v":""},null,null,0]
["SUF","Superficie  (SUF)","kmq",{"$nulls":5},{"$f":"IF(E$3=\"SI\",IF(E10<=0,\"Il valore deve essere maggiore di zero\",\"\"),IF(E10<>0,\"Non risulta gestito il servizio di fognatura\",\"\"))","v":""},null,null,0]
["EEFOG","Consumo di energia elettrica per servizio di fognatura, al netto dell'energia autoprodotta","kWh",null,null,"Il dato include la quota parte relativa ai servizi comuni",null,null,{"$f":"IF(E11<0,\"Il valore deve essere maggiore o uguale a zero\",\"\")","v":""},null,null,0]
[{"$nulls":11},0]
["Valutazione prerequisiti e indicazione istanze presentate per M4",{"$nulls":10},0]
["Aggcond,FOG","Numero agglomerati oggetto di condanna per il servizio di fognatura (causa C-565/10, C-85/13, C-668/19 e successive)","n.",{"$nulls":5},{"$f":"IF(E3=\"SI\",IF(OR(E14<0,E14=\"\"),\"Il valore deve essere maggiore o uguale a zero\",\"\"),IF(E14<>0,\"Non risulta gestito il servizio di fognatura\",\"\"))","v":""},null,null,0]
["AEcond,FOG","Abitanti Equivalenti complessivi degli agglomerati oggetto di condanna per il servizio di fognatura (causa C-565/10, C-85/13, C-668/19 e successive)","A.E.",{"$nulls":5},{"$f":"IF(E3=\"SI\",IF(OR(E15<0,E15=\"\"),\"Il valore deve essere maggiore o uguale a zero\",\"\"),IF(E15<>0,\"Non risulta gestito il servizio di fognatura\",\"\"))","v":""},null,null,0]
{"$rows_left_out":42}
{"sheet":"QT-Depurazione","index":3,"n_rows":158,"n_cols":12,"rows_kept":158,"merged":[[8,7,9,7],[8,8,9,8],[22,7,23,7],[22,8,23,8],[24,7,28,7],[24,8,28,8],[41,7,42,7],[41,8,42,8],[59,7,63,7],[59,8,63,8],[65,7,68,7],[65,8,68,8],[73,7,75,7],[73,8,75,8],[111,7,117,7],[111,8,119,8]]}
[null,"Dati per l'applicazione dei meccanismi di \nincentivazione RQTI (premi e penalità)\nTutti i valori imputati sono intesi essere valori \nconsuntivi ",{"$nulls":9},"Errori compilazione colonna \"Valore Anno 2025\""]
["Notazione dato ","Descrizione dato","UdM",null,"Valore Anno 2025","Note compilazione",null,null,"Errore rilevato in colonna \"Valore Anno 2025\"",null,null,{"$f":"SUM(L3:L144)","v":0}]
["DEP","Il gestore gestisce il servizio di depurazione?","-",null,null,"Al fine del calcolo dei macro-indicatori è necessario indicare se il servizio è gestito",{"$nulls":5},{"$f":"IF(I3=\"\",0,1)","v":0}]
["PRD","Popolazione residente servita","ab.",{"$nulls":5},{"$f":"IF(E$3=\"SI\",IF(E4<=0,\"Il valore deve essere maggiore di zero\",\"\"),IF(E4<>0,\"Non risulta gestito il servizio di depurazione\",\"\"))","v":""},null,null,0]
["PFD","Popolazione fluttuante","ab.",{"$nulls":5},{"$f":"IF(E5<0,\"Il valore deve essere maggiore o uguale a zero\",\"\")","v":""},null,null,0]
["ComD","Numero di comuni serviti (ComD)","n. ",{"$nulls":5},{"$f":"IF(E3=\"SI\",IF(E6<=0,\"Il valore deve essere maggiore di zero\",\"\"),IF(E6<>0,\"Non risulta gestito il servizio di depurazione\",\"\"))","v":""},null,null,0]
["SUD","Superficie  (SUD)","kmq",{"$nulls":5},{"$f":"IF(E3=\"SI\",IF(E7<=0,\"Il valore deve essere maggiore di zero\",\"\"),IF(E7<>0,\"Non risulta gestito il servizio di depurazione\",\"\"))","v":""},null,null,0]
["Cardep","Totale carico inquinante collettato in rete fognaria e depurato in impianti di trattamento di acque reflue urbane incluse vasche Imhoff ","A.E.",{"$nulls":5},{"$f":"IF(AND('QT-Depurazione'!E3=\"SI\",E8<=0),\"Il valore deve essere maggiore di zero\",\"\")","v":""},null,null,0]
["Cardep,dnd","di cui di origine domestica o assimilabile","A.E.",null,null,"Come da definizioni TICSI",null,null,{"$f":"IF(OR(E9<>\"\",E10<>\"\"),IF(OR(E9<0,E10<0,E10+E9<>E8),\"Ogni di cui deve essere maggiore o uguale a zero e la somma deve essere pari a Car_dep\",\"\"),\"\")","v":""},null,null,0]
["Cardep,ind","di cui origine industriale","A.E.",null,null,"Come da definizioni TICSI",{"$nulls":5},0]
["EEDEP","Consumo di energia elettrica per servizio di depurazione, al netto dell'energia autoprodotta","kWh",null,null,"Il dato include la quota parte relativa ai servizi comuni",null,null,{"$f":"IF(E11<0,\"Il valore deve essere maggiore o uguale a zero\",\"\")","v":""},null,null,0]
["EEDEP,ess","di cui per sezione di essiccamento fanghi","kWh",null,null,"(Dato facoltativo) ",null,null,{"$f":"IF(OR(E12<0,E12>E11),\"Il valore deve essere maggiore o uguale a zero e minore di EE_DEP\",\"\")","v":""},null,null,0]
[{"$nulls":11},0]
["Valutazione prerequisiti e indicazione istanze presentate per M5",{"$nulls":10},0]
["Aggcond,DEP","Numero agglomerati oggetto di condanna per il servizio di depurazione (causa C-565/10, C-85/13, C-668/19 e successive)","n.",null,null,"Quesito riferito al 31 dicembre di ogni anno (a-1), ai sensi dell'Art. 22 della RQTI",null,null,{"$f":"IF(E3=\"SI\",IF(OR(E15<0,E15=\"\",E15>E36),\"Il valore deve essere maggiore o uguale a zero e minore o oguale ad Agg_tot\",\"\"),IF(E15<>0,\"Non risulta gestito il servizio di depurazione\",\"\"))","v":""},null,null,0]
{"$rows_left_out":144}
{"sheet":"QT-Altri dati","index":4,"n_rows":184,"n_cols":12,"rows_kept":184,"merged":[[14,7,16,7],[14,8,16,8],[21,7,22,7],[21,8,22,8],[34,8,37,8],[39,7,40,7],[39,8,40,8],[53,8,56,8],[58,8,60,8],[68,8,73,8],[85,8,90,8],[95,7,96,7],[95,8,96,8],[104,8,110,8],[112,8,113,8],[115,7,116,7],[115,8,116,8],[120,8,124,8],[126,8,132,8],[135,8,139,8],[141,8,147,8]]}
[null,"Altri dati di qualità tecnica \nTutti i valori imputati sono intesi essere valori \nconsuntivi ",{"$nulls":9},"Errori compilazione colonna \"Valore Anno 2025\""]
["Notazione dato ","Descrizione dato","UdM",null,"Valore Anno 2025","Note compilazione",null,null,"Errore rilevato in colonna \"Valore Anno 2025\"",null,null,{"$f":"SUM(L3:L177)+SUM(K161:K176)","v":0}]
[{"$nulls":11},{"$f":"IF(I3=\"\",0,1)","v":0}]
["ACQUEDOTTO - Dati relativi agli indennizzi per mancato rispetto degli Standard Specifici di Qualità tecnica",{"$nulls":10},0]
["∑US1ind ","Sommatoria degli utenti finali (compresi utenti indiretti) con diritto all'indennizzo automatico per S1","n.",null,null,"Gli utenti interessati si contano tante volte quanti sono i mancati rispetti dello standard con diritto all'indennizzo automatico ",null,null,{"$f":"IF(OR(E5<0,E5>'QT-Acquedotto'!E111),\"Il valore deve essere maggiore o uguale a zero e minore o uguale a ∑US1\",\"\")","v":""},null,null,0]
["∑US2ind ","Sommatoria degli utenti finali (compresi utenti indiretti) con diritto all'indennizzo automatico per S2","n.",null,null,"Gli utenti interessati si contano tante volte quanti sono i mancati rispetti dello standard con diritto all'indennizzo automatico ",null,null,{"$f":"IF(OR(E6<0,E6>'QT-Acquedotto'!E112),\"Il valore deve essere maggiore o uguale a zero e minore o uguale a ∑US2\",\"\")","v":""},null,null,0]
["∑US3ind ","Sommatoria degli utenti finali (compresi utenti indiretti) con diritto all'indennizzo automatico per S3","n.",null,null,"Gli utenti interessati si contano tante volte quanti sono i mancati rispetti dello standard con diritto all'indennizzo automatico ",null,null,{"$f":"IF(OR(E7<0,E7>'QT-Acquedotto'!E113),\"Il valore deve essere maggiore o uguale a zero e minore o uguale a ∑US3\",\"\")","v":""},null,null,0]
["IndC","Ammontare complessivo degli indennizzi erogato agli utenti finali (inclusi utenti indiretti) interessati da mancato rispetto degli standard specifici di qualità tecnica","€",null,null,"Quesito riferito all'intervallo temporale dal 1 gennaio al 31 dicembre di ogni anno",null,null,{"$f":"IF(E8<0,\"Il valore deve essere maggiore o uguale a zero\",\"\")","v":""},null,null,0]
["IndNC","Ammontare complessivo degli indennizzi non ancora corrisposto agli utenti finali (inclusi utenti indiretti) interessati da mancato rispetto degli standard specifici di qualità tecnica","€",null,null,"Quesito riferito all'intervallo temporale dal 1 gennaio al 31 dicembre di ogni anno",null,null,{"$f":"IF(E9<0,\"Il valore deve essere maggiore o uguale a zero\",\"\")","v":""},null,null,0]
["S_plus","Indicare se nella Carta dei Servizi in vigore è garantito uno standard migliorativo per gli standard specifici S1 e/o S2 e/o S3","-",null,null,"Eventualmente specificare in relazione",{"$nulls":5},0]
[{"$nulls":11},0]
["ACQUEDOTTO - Dati sulla misura di utenza, inclusi obblighi di cui all'art. 15 dell'Allegato A alla del. 218/2016/R/idr (TIMSII)",{"$nulls":10},0]
["UtT","Numero di utenti finali serviti dal gestore per il servizio di acquedotto (esclusi utenti indiretti)","n.",null,{"$f":"'QT-Acquedotto'!E80","v":0},{"$nulls":6},0]
["UtTmis","Numero di utenze finali dotate di misuratore (esclusi utenti indiretti)","n.",null,null,"Vedere TIMSII, comma 15.1",null,null,{"$f":"IF(OR(E14<0,E14>E13),\"Il valore deve essere maggiore o uguale a zero e minore o uguale a UtT\",\"\")","v":""},null,null,0]
["UtTmis_acc","di cui con misuratori accessibili","n.",null,null,"Vedere TIMSII, comma 15.1",null,null,{"$f":"IF(OR(E15<>\"\",E16<>\"\",E17<>\"\"),IF(OR(E15<0,E16<0,E17<0,E15+E16+E17<>E14),\"Ogni di cui deve essere maggiore o uguale a zero e la somma deve essere pari a UtTmis\",\"\"),\"\")","v":""},null,null,0]
{"$rows_left_out":170}
{"sheet":"QT-Resilienza","index":5,"n_rows":121,"n_cols":12,"rows_kept":121,"merged":[[40,8,46,8]]}
[null,"Dati per l'applicazione dei meccanismi di \nincentivazione RQTI (premi e penalità)\nTutti i valori imputati sono intesi essere valori \nconsuntivi ",{"$nulls":9},"Errori compilazione colonna \"Valore Anno 2025\""]
["Notazione dato ","Descrizione dato","UdM",null,"Valore Anno 2025","Note compilazione",null,null,"Errore rilevato in colonna \"Valore Anno 2025\"",null,null,{"$f":"SUM(L3:L90)","v":0}]
["ACQ","Il gestore gestisce il servizio di acquedotto?","-",null,{"$f":"'QT-Acquedotto'!E3","v":0},{"$nulls":6},{"$f":"IF(I3=\"\",0,1)","v":0}]
["FOG","Il gestore gestisce il servizio di fognatura?","-",null,{"$f":"'QT-Fognatura'!E3","v":0},{"$nulls":6},0]
["DEP","Il gestore gestisce il servizio di depurazione?","-",null,{"$f":"'QT-Depurazione'!E3","v":0},{"$nulls":6},0]
["QR1","Indicare se il macro-indicatore M0 è determinato congiuntamente con altri gestori (grossisti)","-",null,null,"Fornire dettagli in relazione in merito alle gestioni valutate congiuntamente",{"$nulls":5},0]
["QR2","In caso affermativo, indicare i codici ID_ARERA dei grossisti considerati ","-",null,null,"Se è considerato più di un gestore grossista, indicare tutti gli ID_ARERA consecutivamente, separati da un trattino",null,null,{"$f":"IF(AND(E6=\"SI\",E7=\"\"),\"Indicare codici ID_ARERA dei grossisti considerati\",\"\")","v":""},null,null,0]
[]
["Valutazione prerequisiti e indicazione istanze presentate per M0"]
["Preq4M0","Indicare l'esito della validazione ai fini della valutazione della disponibilità e affidabilità dei dati per M0 (prerequisito Preq4) ","-",null,null,"Indicare la presenza o meno del prerequisito Preq4 (Art.23 RQTI) ",null,null,{"$f":"IF(AND(E$3=\"SI\",OR(E10=\"Non adeguato\",E10=\"\")),\"Attenzione, prerequisito mancante\",\"\")","v":""},null,null,{"$f":"IF(I10=\"\",0,1)","v":0}]
["IstD,M0","Indicare se è stata formulata istanza per eventi imprevisti e imprevedibili che hanno comportato il mancato rispetto degli obiettivi per M0","-",null,null,"Istanza ex-post ai sensi del comma 5.4, del. 917/2017 ",{"$nulls":5},0]
[]
["Calcolo dell'indicatore M0a"]
["∑disp_SII","Somma dei volumi di disponibilità idrica a livello di gestione del SII","mc",null,{"$f":"E15+E16+E17+E18+E19","v":0},{"$nulls":6},0]
["∑falda_SII","di cui proveniente da falda_SII","mc",null,null,"Volumi indicati nelle concessioni di derivazione, ai sensi del comma 5-ter.2",null,null,{"$f":"IF(E15<0,\"Il valore deve essere maggiore o uguale a zero\",\"\")","v":""},null,null,0]
{"$rows_left_out":91}
{"sheet":"Riepilogo RQTI","index":6,"n_rows":97,"n_cols":7,"rows_kept":97,"merged":[[1,0,1,1],[2,0,10,0],[11,0,19,0],[20,0,26,0],[27,0,38,0],[39,0,50,0],[51,0,60,0],[61,0,68,0],[69,0,76,0]]}
[null,"Riepilogo RQTI: valutazione performance biennio 2024-2025"]
["Macro-indicatore",null,"Valori 2023 per definizione obiettivi","Definizione obiettivo 2024","Definizione obiettivo 2025","Valori 2024 consuntivi","Valori 2025 consuntivi"]
["M0","Presenza prerequisito Preq4M0",{"$nulls":4},{"$f":"IF('QT-Resilienza'!E10=\"\",\"\",'QT-Resilienza'!E10)","v":""}]
[null,"M0a",{"$nulls":4},{"$f":"'QT-Resilienza'!E25","v":""}]
[null,"M0b",{"$nulls":4},{"$f":"'QT-Resilienza'!E66","v":""}]
[null,"DISP",null,{"$f":"IF(C7=\"A\",C6,C9)","v":""},{"$f":"IF(D7=\"A\",D6,D9)","v":""},null,{"$f":"IF('QT-Resilienza'!E71=0,\"\",'QT-Resilienza'!E71)","v":""}]
[null,"Classe",{"$f":"IF(OR(C4=\"\",C5=\"\"),\"\",IF(AND(C4<0.4,C5<=1),\"A\",IF(AND(C4<0.5,C5<=1),\"B\",IF(AND(C4<0.7,C5<=1),\"C\",IF(AND(C4<0.95,C5<=1),\"D\",\"E\")))))","v":""},{"$f":"C7","v":""},{"$f":"D7","v":""},null,{"$f":"IF(OR(G4=\"\",G5=\"\"),\"\",IF(AND(G4<0.4,G5<=1),\"A\",IF(AND(G4<0.5,G5<=1),\"B\",IF(AND(G4<0.7,G5<=1),\"C\",IF(AND(G4<0.95,G5<=1),\"D\",\"E\")))))","v":""}]
[null,"Obiettivo RQTI",{"$f":"IF(C7=\"A\",\"Mantenimento\",IF(C7=\"B\",\"+0,2% di DISP\",IF(C7=\"C\",\"+0,5% di DISP\",IF(C7=\"D\",\"+0,7% di DISP\",IF(C7=\"E\",\"+1% di DISP\",\"\")))))","v":""},{"$f":"IF(D7=\"A\",\"Mantenimento\",IF(D7=\"B\",\"+0,2% di DISP\",IF(D7=\"C\",\"+0,5% di DISP\",IF(D7=\"D\",\"+0,7% di DISP\",IF(D7=\"E\",\"+1% di DISP\",\"\")))))","v":""}]
[null,"Valore obiettivo DISP",{"$f":"IF(C7=\"A\",\"\",IF(C7=\"B\",C6+(0.002*C6),IF(C7=\"C\",C6+(0.005*C6),IF(C7=\"D\",C6+(0.007*C6),IF(C7=\"E\",C6+(0.01*C6),\"\")))))","v":""},{"$f":"IF(D7=\"A\",\"\",IF(D7=\"B\",D6+(0.002*D6),IF(D7=\"C\",D6+(0.005*D6),IF(D7=\"D\",D6+(0.007*D6),IF(D7=\"E\",D6+(0.01*D6),\"\")))))","v":""}]
[null,"Raggiungimento obiettivo",{"$nulls":4},{"$f":"IF(E7=\"\",\"\",IF(OR(AND(E7=\"A\",G7=\"A\"),AND(G81=\"SI\",E7<>\"A\",G6>=E6)),\"SI\",\"NO\"))","v":""}]
[null,"Anno di riferimento per definizione obiettivi",2023]
["M1","Presenza prerequisito Preq1",{"$nulls":4},{"$f":"'QT-Acquedotto'!E22","v":""}]
[null,"Presenza prerequisito Preq4M1",{"$nulls":4},{"$f":"IF('QT-Acquedotto'!E23=\"\",\"\",'QT-Acquedotto'!E23)","v":""}]
[null,"M1a",null,{"$f":"IF(C16=\"A\",$C14,C18)","v":""},{"$f":"IF(D16=\"A\",$D14,D18)","v":""},null,{"$f":"IF('QT-Acquedotto'!E45=\"\",\"\",'QT-Acquedotto'!E45)","v":""}]
[null,"M1b",null,{"$f":"IF(C16=\"A\",C15,IF(C16=\"B\",C15-(0.02*C15),IF(C16=\"C\",C15-(0.04*C15),IF(C16=\"D\",C15-(0.05*C15),IF(C16=\"E\",C15-(0.06*C15),\"\")))))","v":""},{"$f":"IF(D16=\"A\",D15,IF(D16=\"B\",D15-(0.02*D15),IF(D16=\"C\",D15-(0.04*D15),IF(D16=\"D\",D15-(0.05*D15),IF(D16=\"E\",D15-(0.06*D15),\"\")))))","v":""},null,{"$f":"IF('QT-Acquedotto'!E46=\"\",\"\",'QT-Acquedotto'!E46)","v":""}]
{"$rows_left_out":76}
{"sheet":"TT_Gestori-ATO","index":7,"n_rows":1882,"n_cols":9,"rows_kept":1882,"hidden":true}
[{"$nulls":8},"aggiornata 16/02/2026"]
[null,"ID ATO","ATO",null,null,"ID ARERA Gestore","GESTORE"]
[null,101,"ATO 1 - VERBANO-CUSIO-OSSOLA E PIANURA NOVARESE",null,null,5,"AZIENDA PUBBLISERVIZI BRUNICO"]
[null,102,"ATO 2 - BIELLESE, VERCELLESE, CASALESE",null,null,52,"SOGIP S.R.L."]
[null,103,"ATO 3 - TORINO",null,null,55,"COMUNE DI VERMIGLIO"]
[null,104,"ATO 4 - CUNEO",null,null,78,"Comune di Castello - Molina di Fiemme"]
[null,105,"ATO 5 - ASTIGIANO, MONFERRATO",null,null,79,"COMUNE DI CAVALESE"]
[null,106,"ATO 6 - ALESSANDRIA",null,null,183,"COMUNE DI PARCINES"]
[null,201,"ATO VALLE D'AOSTA",null,null,188,"COMUNE DI BARETE"]
[null,301,"ATO BG - BERGAMO",null,null,199,"COMUNE DI PALU' DEL FERSINA"]
[null,302,"ATO BS - BRESCIA",null,null,201,"COMUNE DI BESENELLO"]
[null,304,"ATO CO - COMO",null,null,206,"COMUNE DI FAI DELLA PAGANELLA"]
[null,305,"ATO CR - CREMONA",null,null,230,"A.S.SE.M. SPA"]
[null,306,"ATO LC - LECCO",null,null,245,"COMUNE DI AVIO"]
[null,307,"ATO LO - LODI",null,null,258,"COMUNE DI ANVERSA DEGLI ABRUZZI"]
{"$rows_left_out":1867}